{"text_format":"1","workbook":"xlsx","n_sheets":4,"sheets":["Données","AGE","Visualisation","Liste déroulante"],"not_rendered":{"charts":0,"images":0,"macros":1,"external_links":0,"defined_names":14,"comments":0,"pivot_tables":0},"unopened":[],"bounds":{"document_bytes":16777216,"sheet_cells":100000,"rows_first":2000,"rows_last":500,"rows_between":2000,"halvings":0,"cell_chars":16384,"cell_head_chars":4096},"cells_cut":0,"cells_raw":0,"read":"whole","date_system":"1900"}

{"sheet":"Données","index":0,"n_rows":242,"n_cols":23,"rows_kept":242,"cut":false,"hidden":true,"merged":[]}
[null,null,null,null,"Distance officielle","Sur les épreuvesJeune : Natation : …………..1 min 50 au 100 m Vélo : .......... …….25 km/h Course à pied : ……5 min au km"]
[null,null,null,null,null,"Natation : ……………1 min 45 au 100 m Vélo route : ………….32 km/h Vélo (cross) : ……….15 km/h Course à pied : ……...4 min:30 au km Ski de fond : …………4 min 30 au km",null,null,null,null,null,null,null,null,{"$f":"K7/1000","v":5.0000000000000001E-3}]
[]
["Epreuve","Catégorie","Discipline",null,"Course",null,"Discipline","Distance","Marge\n Maxi","Marge\n Mini","Vitesse","Unité","Base de Temps (min / m)","Temps\nMoyen","Limite Haute 25%\n(min)","Limite Haute 40%\n(min)","Limite Basse\n(min)","Distance\nMoyenne","Limite Haute 25%\n(m)","Limite Haute 40%\n(m)","Limite Basse\n(m)","Age Mini","Age Maxi"]
[10,10,1,{"$f":"CONCATENATE(A5,B5,C5)","v":"10101"},"Triathlon","Jeune 6-9","Natation",50,{"$f":"H5*1.1","v":55.000000000000007},{"$f":"H5*0.9","v":45},{"$f":"60+50","v":110},"Sec/100m",{"$f":"IF(L5=\"Sec/100m\",((K5)/60/100),(IF(L5=\"Km/h\",60/K5/1000,(IF(L5=\"Min/km\",K5/1000,\"\")))))","v":1.8333333333333333E-2},{"$f":"H5*M5","v":0.91666666666666663},{"$f":"N5*1.25","v":1.1458333333333333},{"$f":"N5*1.4","v":1.2833333333333332},{"$f":"O5*0.8","v":0.91666666666666663},{"$f":"(N5/M5)","v":50},{"$f":"O5/M5","v":62.499999999999993},{"$f":"P5/M5","v":70},{"$f":"+R5/2","v":25},{"$f":"VLOOKUP(F5,AGE!F:J,4,FALSE)","v":2013},{"$f":"VLOOKUP(F5,AGE!F:J,5,FALSE)","v":2010}]
[10,10,2,{"$f":"CONCATENATE(A6,B6,C6)","v":"10102"},"Triathlon","Jeune 6-9","Cyclisme",1000,{"$f":"H6*1.1","v":1100},{"$f":"H6*0.9","v":900},25,"Km/h",{"$f":"IF(L6=\"Sec/100m\",((K6)/60/100),(IF(L6=\"Km/h\",60/K6/1000,(IF(L6=\"Min/km\",K6/1000,\"\")))))","v":2.3999999999999998E-3},{"$f":"H6*M6","v":2.4},{"$f":"N6*1.25","v":3},{"$f":"N6*1.4","v":3.36},{"$f":"O6*0.8","v":2.4000000000000004},{"$f":"N6/M6","v":1000},{"$f":"O6/M6","v":1250},{"$f":"P6/M6","v":1400},{"$f":"+R6/2","v":500},{"$f":"VLOOKUP(F6,AGE!F:J,4,FALSE)","v":2013},{"$f":"VLOOKUP(F6,AGE!F:J,5,FALSE)","v":2010}]
[10,10,3,"10103","Triathlon","Jeune 6-9","Course à pied",500,550,450,5,"Min/km",5.0000000000000001E-3,2.5,3.125,3.5,{"$f":"O7*0.8","v":2.5},500,625,700,{"$f":"+R7/2","v":250},{"$f":"VLOOKUP(F7,AGE!F:J,4,FALSE)","v":2013},{"$f":"VLOOKUP(F7,AGE!F:J,5,FALSE)","v":2010}]
[10,10,4,"10104","Triathlon","Jeune 6-9","Total",{"$f":"SUM(H5:H7)","v":1550},{"$f":"SUM(I5:I7)","v":1705},1395,null,null,null,5.8166666666666664,7.270833333333333,null,null,{"$f":"SUM(R5:R7)","v":1550},{"$f":"SUM(S5:S7)","v":1937.5},null,{"$f":"SUM(U5:U7)","v":775},{"$f":"VLOOKUP(F8,AGE!F:J,4,FALSE)","v":2013},{"$f":"VLOOKUP(F8,AGE!F:J,5,FALSE)","v":2010}]
[10,20,1,"10201","Triathlon","Jeune 8-11","Natation",100,{"$f":"H9*1.1","v":110.00000000000001},{"$f":"H9*0.9","v":90},{"$f":"60+50","v":110},"Sec/100m",{"$f":"IF(L9=\"Sec/100m\",((K9)/60/100),(IF(L9=\"Km/h\",60/K9/1000,(IF(L9=\"Min/km\",K9/1000,\"\")))))","v":1.8333333333333333E-2},{"$f":"H9*M9","v":1.8333333333333333},{"$f":"N9*1.25","v":2.2916666666666665},{"$f":"N9*1.4","v":2.5666666666666664},{"$f":"O5","v":1.1458333333333333},{"$f":"N9/M9","v":100},{"$f":"O9/M9","v":124.99999999999999},{"$f":"P9/M9","v":140},{"$f":"S5+1","v":63.499999999999993},{"$f":"VLOOKUP(F9,AGE!F:J,4,FALSE)","v":2011},{"$f":"VLOOKUP(F9,AGE!F:J,5,FALSE)","v":2008}]
[10,20,2,"10202","Triathlon","Jeune 8-11","Cyclisme",2000,{"$f":"H10*1.1","v":2200},{"$f":"H10*0.9","v":1800},25,"Km/h",{"$f":"IF(L10=\"Sec/100m\",((K10)/60/100),(IF(L10=\"Km/h\",60/K10/1000,(IF(L10=\"Min/km\",K10/1000,\"\")))))","v":2.3999999999999998E-3},{"$f":"H10*M10","v":4.8},{"$f":"N10*1.25","v":6},{"$f":"N10*1.4","v":6.72},{"$f":"O6","v":3},{"$f":"N10/M10","v":2000},{"$f":"O10/M10","v":2500},{"$f":"P10/M10","v":2800},{"$f":"S6+1","v":1251},{"$f":"VLOOKUP(F10,AGE!F:J,4,FALSE)","v":2011},{"$f":"VLOOKUP(F10,AGE!F:J,5,FALSE)","v":2008}]
[10,20,3,"10203","Triathlon","Jeune 8-11","Course à pied",1000,1100,900,5,"Min/km",5.0000000000000001E-3,5,6.25,7,3.125,1000,1250,1400,{"$f":"S7+1","v":626},{"$f":"VLOOKUP(F11,AGE!F:J,4,FALSE)","v":2011},{"$f":"VLOOKUP(F11,AGE!F:J,5,FALSE)","v":2008}]
[10,20,4,"10204","Triathlon","Jeune 8-11","Total",{"$f":"SUM(H9:H11)","v":3100},{"$f":"SUM(I9:I11)","v":3410},{"$f":"SUM(J9:J11)","v":2790},null,null,null,{"$f":"SUM(N9:N11)","v":11.633333333333333},{"$f":"SUM(O9:O11)","v":14.541666666666666},null,{"$f":"SUM(Q9:Q11)","v":7.270833333333333},{"$f":"SUM(R9:R11)","v":3100},{"$f":"SUM(S9:S11)","v":3875},null,{"$f":"SUM(U9:U11)","v":1940.5},{"$f":"VLOOKUP(F12,AGE!F:J,4,FALSE)","v":2011},{"$f":"VLOOKUP(F12,AGE!F:J,5,FALSE)","v":2008}]
[10,30,1,"10301","Triathlon","Jeune 10-13","Natation",200,{"$f":"H13*1.1","v":220.00000000000003},{"$f":"H13*0.9","v":180},{"$f":"60+50","v":110},"Sec/100m",{"$f":"IF(L13=\"Sec/100m\",((K13)/60/100),(IF(L13=\"Km/h\",60/K13/1000,(IF(L13=\"Min/km\",K13/1000,\"\")))))","v":1.8333333333333333E-2},{"$f":"H13*M13","v":3.6666666666666665},{"$f":"N13*1.25","v":4.583333333333333},{"$f":"N13*1.4","v":5.1333333333333329},{"$f":"O9","v":2.2916666666666665},{"$f":"N13/M13","v":200},{"$f":"O13/M13","v":249.99999999999997},{"$f":"P13/M13","v":280},{"$f":"S9+1","v":125.99999999999999},{"$f":"VLOOKUP(F13,AGE!F:J,4,FALSE)","v":2009},{"$f":"VLOOKUP(F13,AGE!F:J,5,FALSE)","v":2006}]
[10,30,2,"10302","Triathlon","Jeune 10-13","Cyclisme",4000,{"$f":"H14*1.1","v":4400},{"$f":"H14*0.9","v":3600},25,"Km/h",{"$f":"IF(L14=\"Sec/100m\",((K14)/60/100),(IF(L14=\"Km/h\",60/K14/1000,(IF(L14=\"Min/km\",K14/1000,\"\")))))","v":2.3999999999999998E-3},{"$f":"H14*M14","v":9.6},{"$f":"N14*1.25","v":12},{"$f":"N14*1.4","v":13.44},{"$f":"O10","v":6},{"$f":"N14/M14","v":4000},{"$f":"O14/M14","v":5000},{"$f":"P14/M14","v":5600},{"$f":"S10+1","v":2501},{"$f":"VLOOKUP(F14,AGE!F:J,4,FALSE)","v":2009},{"$f":"VLOOKUP(F14,AGE!F:J,5,FALSE)","v":2006}]
[10,30,3,"10303","Triathlon","Jeune 10-13","Course à pied",1500,1650.0000000000002,1350,5,"Min/km",5.0000000000000001E-3,7.5,9.375,10.5,6.25,1500,1875,2100,{"$f":"S11+1","v":1251},{"$f":"VLOOKUP(F15,AGE!F:J,4,FALSE)","v":2009},{"$f":"VLOOKUP(F15,AGE!F:J,5,FALSE)","v":2006}]
[10,30,4,"10304","Triathlon","Jeune 10-13","Total",{"$f":"SUM(H13:H15)","v":5700},{"$f":"SUM(I13:I15)","v":6270},{"$f":"SUM(J13:J15)","v":5130},null,null,null,{"$f":"SUM(N13:N15)","v":20.766666666666666},{"$f":"SUM(O13:O15)","v":25.958333333333332},null,{"$f":"SUM(Q13:Q15)","v":14.541666666666666},{"$f":"SUM(R13:R15)","v":5700},{"$f":"SUM(S13:S15)","v":7125},null,{"$f":"SUM(U13:U15)","v":3878},{"$f":"VLOOKUP(F16,AGE!F:J,4,FALSE)","v":2009},{"$f":"VLOOKUP(F16,AGE!F:J,5,FALSE)","v":2006}]
[10,40,1,"10401","Triathlon","Jeune 12-19","Natation",300,{"$f":"H17*1.1","v":330},{"$f":"H17*0.9","v":270},{"$f":"60+50","v":110},"Sec/100m",{"$f":"IF(L17=\"Sec/100m\",((K17)/60/100),(IF(L17=\"Km/h\",60/K17/1000,(IF(L17=\"Min/km\",K17/1000,\"\")))))","v":1.8333333333333333E-2},{"$f":"H17*M17","v":5.5},{"$f":"N17*1.25","v":6.875},{"$f":"N17*1.4","v":7.6999999999999993},{"$f":"O13","v":4.583333333333333},{"$f":"N17/M17","v":300},{"$f":"O17/M17","v":375},{"$f":"P17/M17","v":419.99999999999994},{"$f":"S13+1","v":250.99999999999997},{"$f":"VLOOKUP(F17,AGE!F:J,4,FALSE)","v":2007},{"$f":"VLOOKUP(F17,AGE!F:J,5,FALSE)","v":2000}]
[10,40,2,"10402","Triathlon","Jeune 12-19","Cyclisme",6000,{"$f":"H18*1.1","v":6600.0000000000009},{"$f":"H18*0.9","v":5400},25,"Km/h",{"$f":"IF(L18=\"Sec/100m\",((K18)/60/100),(IF(L18=\"Km/h\",60/K18/1000,(IF(L18=\"Min/km\",K18/1000,\"\")))))","v":2.3999999999999998E-3},{"$f":"H18*M18","v":14.399999999999999},{"$f":"N18*1.25","v":18},{"$f":"N18*1.4","v":20.159999999999997},{"$f":"O14","v":12},{"$f":"N18/M18","v":6000},{"$f":"O18/M18","v":7500.0000000000009},{"$f":"P18/M18","v":8400},{"$f":"S14+1","v":5001},{"$f":"VLOOKUP(F18,AGE!F:J,4,FALSE)","v":2007},{"$f":"VLOOKUP(F18,AGE!F:J,5,FALSE)","v":2000}]
[10,40,3,"10403","Triathlon","Jeune 12-19","Course à pied",2000,2200,1800,5,"Min/km",5.0000000000000001E-3,10,12.5,14,9.375,2000,2500,2800,{"$f":"S15+1","v":1876},{"$f":"VLOOKUP(F19,AGE!F:J,4,FALSE)","v":2007},{"$f":"VLOOKUP(F19,AGE!F:J,5,FALSE)","v":2000}]
[10,40,4,"10404","Triathlon","Jeune 12-19","Total",{"$f":"SUM(H17:H19)","v":8300},{"$f":"SUM(I17:I19)","v":9130},{"$f":"SUM(J17:J19)","v":7470},null,null,null,{"$f":"SUM(N17:N19)","v":29.9},{"$f":"SUM(O17:O19)","v":37.375},null,{"$f":"SUM(Q17:Q19)","v":25.958333333333332},{"$f":"SUM(R17:R19)","v":8300},{"$f":"SUM(S17:S19)","v":10375},null,{"$f":"SUM(U17:U19)","v":7128},{"$f":"VLOOKUP(F20,AGE!F:J,4,FALSE)","v":2007},{"$f":"VLOOKUP(F20,AGE!F:J,5,FALSE)","v":2000}]
[10,50,1,"10501","Triathlon","Distance XS","Natation",400,{"$f":"H21*1.1","v":440.00000000000006},{"$f":"H21*0.9","v":360},105,"Sec/100m",{"$f":"IF(L21=\"Sec/100m\",((K21)/60/100),(IF(L21=\"Km/h\",60/K21/1000,(IF(L21=\"Min/km\",K21/1000,\"\")))))","v":1.7500000000000002E-2},{"$f":"H21*M21","v":7.0000000000000009},{"$f":"N21*1.25","v":8.7500000000000018},9.8000000000000007,{"$f":"O17","v":6.875},{"$f":"N21/M21","v":400},{"$f":"O21/M21","v":500.00000000000006},{"$f":"P21/M21","v":560},{"$f":"S17+1","v":376},{"$f":"VLOOKUP(F21,AGE!F:J,4,FALSE)","v":2007},{"$f":"VLOOKUP(F21,AGE!F:J,5,FALSE)","v":1920}]
[10,50,2,"10502","Triathlon","Distance XS","Cyclisme",10000,{"$f":"H22*1.1","v":11000},{"$f":"H22*0.9","v":9000},32,"Km/h",{"$f":"IF(L22=\"Sec/100m\",((K22)/60/100),(IF(L22=\"Km/h\",60/K22/1000,(IF(L22=\"Min/km\",K22/1000,\"\")))))","v":1.8749999999999999E-3},{"$f":"H22*M22","v":18.75},{"$f":"N22*1.25","v":23.4375},26.25,{"$f":"O18","v":18},{"$f":"N22/M22","v":10000},{"$f":"O22/M22","v":12500},{"$f":"P22/M22","v":14000},{"$f":"S18+1","v":7501.0000000000009},{"$f":"VLOOKUP(F22,AGE!F:J,4,FALSE)","v":2007},{"$f":"VLOOKUP(F22,AGE!F:J,5,FALSE)","v":1920}]
[10,50,3,"10503","Triathlon","Distance XS","Course à pied",2500,2750,2250,4.5,"Min/km",4.4999999999999997E-3,11.25,14.0625,15.749999999999998,12.5,2500,3125.0000000000005,3500,{"$f":"S19+1","v":2501},{"$f":"VLOOKUP(F23,AGE!F:J,4,FALSE)","v":2007},{"$f":"VLOOKUP(F23,AGE!F:J,5,FALSE)","v":1920}]
[10,50,4,"10504","Triathlon","Distance XS","Total",{"$f":"SUM(H21:H23)","v":12900},{"$f":"SUM(I21:I23)","v":14190},{"$f":"SUM(J21:J23)","v":11610},null,null,null,{"$f":"SUM(N21:N23)","v":37},{"$f":"SUM(O21:O23)","v":46.25},null,{"$f":"SUM(Q21:Q23)","v":37.375},{"$f":"SUM(R21:R23)","v":12900},{"$f":"SUM(S21:S23)","v":16125},null,{"$f":"SUM(U21:U23)","v":10378},{"$f":"VLOOKUP(F24,AGE!F:J,4,FALSE)","v":2007},{"$f":"VLOOKUP(F24,AGE!F:J,5,FALSE)","v":1920}]
[10,60,1,"10601","Triathlon","Distance S","Natation",750,{"$f":"H25*1.1","v":825.00000000000011},{"$f":"H25*0.9","v":675},105,"Sec/100m",{"$f":"IF(L25=\"Sec/100m\",((K25)/60/100),(IF(L25=\"Km/h\",60/K25/1000,(IF(L25=\"Min/km\",K25/1000,\"\")))))","v":1.7500000000000002E-2},{"$f":"H25*M25","v":13.125000000000002},{"$f":"N25*1.25","v":16.406250000000004},18.375,{"$f":"O21","v":8.7500000000000018},{"$f":"N25/M25","v":750},{"$f":"O25/M25","v":937.50000000000011},{"$f":"P25/M25","v":1050},{"$f":"S21+1","v":501.00000000000006},{"$f":"VLOOKUP(F25,AGE!F:J,4,FALSE)","v":2003},{"$f":"VLOOKUP(F25,AGE!F:J,5,FALSE)","v":1920}]
[10,60,2,"10602","Triathlon","Distance S","Cyclisme",20000,{"$f":"H26*1.1","v":22000},{"$f":"H26*0.9","v":18000},32,"Km/h",{"$f":"IF(L26=\"Sec/100m\",((K26)/60/100),(IF(L26=\"Km/h\",60/K26/1000,(IF(L26=\"Min/km\",K26/1000,\"\")))))","v":1.8749999999999999E-3},{"$f":"H26*M26","v":37.5},{"$f":"N26*1.25","v":46.875},52.5,{"$f":"O22","v":23.4375},{"$f":"N26/M26","v":20000},{"$f":"O26/M26","v":25000},{"$f":"P26/M26","v":28000},{"$f":"S22+1","v":12501},{"$f":"VLOOKUP(F26,AGE!F:J,4,FALSE)","v":2003},{"$f":"VLOOKUP(F26,AGE!F:J,5,FALSE)","v":1920}]
[10,60,3,"10603","Triathlon","Distance S","Course à pied",5000,5500,4500,4.5,"Min/km",4.4999999999999997E-3,22.5,28.125,31.499999999999996,{"$f":"O23","v":14.0625},5000,6250.0000000000009,7000,{"$f":"S23+1","v":3126.0000000000005},{"$f":"VLOOKUP(F27,AGE!F:J,4,FALSE)","v":2003},{"$f":"VLOOKUP(F27,AGE!F:J,5,FALSE)","v":1920}]
[10,60,4,"10604","Triathlon","Distance S","Total",{"$f":"SUM(H25:H27)","v":25750},{"$f":"SUM(I25:I27)","v":28325},{"$f":"SUM(J25:J27)","v":23175},null,null,null,{"$f":"SUM(N25:N27)","v":73.125},{"$f":"SUM(O25:O27)","v":91.40625},null,{"$f":"SUM(Q25:Q27)","v":46.25},{"$f":"SUM(R25:R27)","v":25750},{"$f":"SUM(S25:S27)","v":32187.5},null,{"$f":"SUM(U25:U27)","v":16128},{"$f":"VLOOKUP(F28,AGE!F:J,4,FALSE)","v":2003},{"$f":"VLOOKUP(F28,AGE!F:J,5,FALSE)","v":1920}]
[10,70,1,"10701","Triathlon","Distance M","Natation",1500,{"$f":"H29*1.1","v":1650.0000000000002},{"$f":"H29*0.9","v":1350},105,"Sec/100m",{"$f":"IF(L29=\"Sec/100m\",((K29)/60/100),(IF(L29=\"Km/h\",60/K29/1000,(IF(L29=\"Min/km\",K29/1000,\"\")))))","v":1.7500000000000002E-2},{"$f":"H29*M29","v":26.250000000000004},{"$f":"N29*1.25","v":32.812500000000007},36.75,{"$f":"O25","v":16.406250000000004},{"$f":"N29/M29","v":1500},{"$f":"O29/M29","v":1875.0000000000002},{"$f":"P29/M29","v":2100},{"$f":"S25+1","v":938.50000000000011},{"$f":"VLOOKUP(F29,AGE!F:J,4,FALSE)","v":2001},{"$f":"VLOOKUP(F29,AGE!F:J,5,FALSE)","v":1920}]
[10,70,2,"10702","Triathlon","Distance M","Cyclisme",40000,{"$f":"H30*1.1","v":44000},{"$f":"H30*0.9","v":36000},32,"Km/h",{"$f":"IF(L30=\"Sec/100m\",((K30)/60/100),(IF(L30=\"Km/h\",60/K30/1000,(IF(L30=\"Min/km\",K30/1000,\"\")))))","v":1.8749999999999999E-3},{"$f":"H30*M30","v":75},{"$f":"N30*1.25","v":93.75},105,{"$f":"O26","v":46.875},{"$f":"N30/M30","v":40000},{"$f":"O30/M30","v":50000},{"$f":"P30/M30","v":56000},{"$f":"S26+1","v":25001},{"$f":"VLOOKUP(F30,AGE!F:J,4,FALSE)","v":2001},{"$f":"VLOOKUP(F30,AGE!F:J,5,FALSE)","v":1920}]
[10,70,3,"10703","Triathlon","Distance M","Course à pied",10000,11000,9000,4.5,"Min/km",4.4999999999999997E-3,45,56.25,62.999999999999993,28.125,10000,12500.000000000002,14000,{"$f":"S27+1","v":6251.0000000000009},{"$f":"VLOOKUP(F31,AGE!F:J,4,FALSE)","v":2001},{"$f":"VLOOKUP(F31,AGE!F:J,5,FALSE)","v":1920}]
[10,70,4,"10704","Triathlon","Distance M","Total",{"$f":"SUM(H29:H31)","v":51500},{"$f":"SUM(I29:I31)","v":56650},{"$f":"SUM(J29:J31)","v":46350},null,null,null,{"$f":"SUM(N29:N31)","v":146.25},{"$f":"SUM(O29:O31)","v":182.8125},null,{"$f":"SUM(Q29:Q31)","v":91.40625},{"$f":"SUM(R29:R31)","v":51500},{"$f":"SUM(S29:S31)","v":64375},null,{"$f":"SUM(U29:U31)","v":32190.5},{"$f":"VLOOKUP(F32,AGE!F:J,4,FALSE)","v":2001},{"$f":"VLOOKUP(F32,AGE!F:J,5,FALSE)","v":1920}]
[10,80,1,"10801","Triathlon","Distance L","Natation",3000,{"$f":"H33*1.1","v":3300.0000000000005},{"$f":"H33*0.9","v":2700},105,"Sec/100m",{"$f":"IF(L33=\"Sec/100m\",((K33)/60/100),(IF(L33=\"Km/h\",60/K33/1000,(IF(L33=\"Min/km\",K33/1000,\"\")))))","v":1.7500000000000002E-2},{"$f":"H33*M33","v":52.500000000000007},{"$f":"N33*1.25","v":65.625000000000014},null,{"$f":"O29","v":32.812500000000007},{"$f":"N33/M33","v":3000},{"$f":"O33/M33","v":3750.0000000000005},{"$f":"P33/M33","v":0},{"$f":"S29+1","v":1876.0000000000002},{"$f":"VLOOKUP(F33,AGE!F:J,4,FALSE)","v":2001},{"$f":"VLOOKUP(F33,AGE!F:J,5,FALSE)","v":1920}]
[10,80,2,"10802","Triathlon","Distance L","Cyclisme",80000,{"$f":"H34*1.1","v":88000},{"$f":"H34*0.9","v":72000},32,"Km/h",{"$f":"IF(L34=\"Sec/100m\",((K34)/60/100),(IF(L34=\"Km/h\",60/K34/1000,(IF(L34=\"Min/km\",K34/1000,\"\")))))","v":1.8749999999999999E-3},{"$f":"H34*M34","v":150},{"$f":"N34*1.25","v":187.5},null,{"$f":"O30","v":93.75},{"$f":"N34/M34","v":80000},{"$f":"O34/M34","v":100000},{"$f":"P34/M34","v":0},{"$f":"S30+1","v":50001},{"$f":"VLOOKUP(F34,AGE!F:J,4,FALSE)","v":2001},{"$f":"VLOOKUP(F34,AGE!F:J,5,FALSE)","v":1920}]
[10,80,3,"10803","Triathlon","Distance L","Course à pied",20000,22000,18000,4.5,"Min/km",4.4999999999999997E-3,90,112.5,null,56.25,20000,25000.000000000004,0,{"$f":"S31+1","v":12501.000000000002},{"$f":"VLOOKUP(F35,AGE!F:J,4,FALSE)","v":2001},{"$f":"VLOOKUP(F35,AGE!F:J,5,FALSE)","v":1920}]
[10,80,4,"10804","Triathlon","Distance L","Total",{"$f":"SUM(H33:H35)","v":103000},{"$f":"SUM(I33:I35)","v":113300},{"$f":"SUM(J33:J35)","v":92700},null,null,null,{"$f":"SUM(N33:N35)","v":292.5},{"$f":"SUM(O33:O35)","v":365.625},null,{"$f":"SUM(Q33:Q35)","v":182.8125},{"$f":"SUM(R33:R35)","v":103000},{"$f":"SUM(S33:S35)","v":128750},null,{"$f":"SUM(U33:U35)","v":64378},{"$f":"VLOOKUP(F36,AGE!F:J,4,FALSE)","v":2001},{"$f":"VLOOKUP(F36,AGE!F:J,5,FALSE)","v":1920}]
[10,90,1,"10901","Triathlon","Distance XL","Natation",4000,{"$f":"H37*1.1","v":4400},{"$f":"H37*0.9","v":3600},105,"Sec/100m",{"$f":"IF(L37=\"Sec/100m\",((K37)/60/100),(IF(L37=\"Km/h\",60/K37/1000,(IF(L37=\"Min/km\",K37/1000,\"\")))))","v":1.7500000000000002E-2},{"$f":"H37*M37","v":70},{"$f":"N37*1.25","v":87.5},null,{"$f":"O33","v":65.625000000000014},{"$f":"N37/M37","v":3999.9999999999995},{"$f":"O37/M37","v":4999.9999999999991},{"$f":"P37/M37","v":0},{"$f":"S33+1","v":3751.0000000000005},{"$f":"VLOOKUP(F37,AGE!F:J,4,FALSE)","v":2001},{"$f":"VLOOKUP(F37,AGE!F:J,5,FALSE)","v":1920}]
[10,90,2,"10902","Triathlon","Distance XL","Cyclisme",120000,{"$f":"H38*1.1","v":132000},{"$f":"H38*0.9","v":108000},32,"Km/h",{"$f":"IF(L38=\"Sec/100m\",((K38)/60/100),(IF(L38=\"Km/h\",60/K38/1000,(IF(L38=\"Min/km\",K38/1000,\"\")))))","v":1.8749999999999999E-3},{"$f":"H38*M38","v":225},{"$f":"N38*1.25","v":281.25},null,{"$f":"O34","v":187.5},{"$f":"N38/M38","v":120000},{"$f":"O38/M38","v":150000},{"$f":"P38/M38","v":0},{"$f":"S34+1","v":100001},{"$f":"VLOOKUP(F38,AGE!F:J,4,FALSE)","v":2001},{"$f":"VLOOKUP(F38,AGE!F:J,5,FALSE)","v":1920}]
[10,90,3,"10903","Triathlon","Distance XL","Course à pied",30000,33000,27000,4.5,"Min/km",4.4999999999999997E-3,135,168.75,null,112.5,30000.000000000004,37500,0,{"$f":"S35+1","v":25001.000000000004},{"$f":"VLOOKUP(F39,AGE!F:J,4,FALSE)","v":2001},{"$f":"VLOOKUP(F39,AGE!F:J,5,FALSE)","v":1920}]
[10,90,4,"10904","Triathlon","Distance XL","Total",{"$f":"SUM(H37:H39)","v":154000},{"$f":"SUM(I37:I39)","v":169400},{"$f":"SUM(J37:J39)","v":138600},null,null,null,{"$f":"SUM(N37:N39)","v":430},{"$f":"SUM(O37:O39)","v":537.5},null,{"$f":"SUM(Q37:Q39)","v":365.625},{"$f":"SUM(R37:R39)","v":154000},{"$f":"SUM(S37:S39)","v":192500},null,{"$f":"SUM(U37:U39)","v":128753},{"$f":"VLOOKUP(F40,AGE!F:J,4,FALSE)","v":2001},{"$f":"VLOOKUP(F40,AGE!F:J,5,FALSE)","v":1920}]
[10,91,1,"10911","Triathlon","Distance XXL","Natation",3800,{"$f":"H41*1.1","v":4180},{"$f":"H41*0.9","v":3420},105,"Sec/100m",{"$f":"IF(L41=\"Sec/100m\",((K41)/60/100),(IF(L41=\"Km/h\",60/K41/1000,(IF(L41=\"Min/km\",K41/1000,\"\")))))","v":1.7500000000000002E-2},{"$f":"H41*M41","v":66.5},{"$f":"N41*1.25","v":83.125},null,{"$f":"O37","v":87.5},{"$f":"N41/M41","v":3799.9999999999995},{"$f":"O41/M41","v":4750},{"$f":"P41/M41","v":0},{"$f":"S37+1","v":5000.9999999999991},{"$f":"VLOOKUP(F41,AGE!F:J,4,FALSE)","v":2001},{"$f":"VLOOKUP(F41,AGE!F:J,5,FALSE)","v":1920}]
[10,91,2,"10912","Triathlon","Distance XXL","Cyclisme",180000,{"$f":"H42*1.1","v":198000.00000000003},{"$f":"H42*0.9","v":162000},32,"Km/h",{"$f":"IF(L42=\"Sec/100m\",((K42)/60/100),(IF(L42=\"Km/h\",60/K42/1000,(IF(L42=\"Min/km\",K42/1000,\"\")))))","v":1.8749999999999999E-3},{"$f":"H42*M42","v":337.5},{"$f":"N42*1.25","v":421.875},null,{"$f":"O38","v":281.25},{"$f":"N42/M42","v":180000},{"$f":"O42/M42","v":225000},{"$f":"P42/M42","v":0},{"$f":"S38+1","v":150001},{"$f":"VLOOKUP(F42,AGE!F:J,4,FALSE)","v":2001},{"$f":"VLOOKUP(F42,AGE!F:J,5,FALSE)","v":1920}]
[10,91,3,"10913","Triathlon","Distance XXL","Course à pied",42195,46414.500000000007,37975.5,4.5,"Min/km",4.4999999999999997E-3,189.8775,237.34687500000001,null,168.75,42195,52743.750000000007,0,{"$f":"S39+1","v":37501},{"$f":"VLOOKUP(F43,AGE!F:J,4,FALSE)","v":2001},{"$f":"VLOOKUP(F43,AGE!F:J,5,FALSE)","v":1920}]
[10,91,4,"10914","Triathlon","Distance XXL","Total",{"$f":"SUM(H41:H43)","v":225995},{"$f":"SUM(I41:I43)","v":248594.50000000003},{"$f":"SUM(J41:J43)","v":203395.5},null,null,null,{"$f":"SUM(N41:N43)","v":593.87750000000005},{"$f":"SUM(O41:O43)","v":742.34687499999995},null,{"$f":"SUM(Q41:Q43)","v":537.5},{"$f":"SUM(R41:R43)","v":225995},{"$f":"SUM(S41:S43)","v":282493.75},null,{"$f":"SUM(U41:U43)","v":192503},{"$f":"VLOOKUP(F44,AGE!F:J,4,FALSE)","v":2001},{"$f":"VLOOKUP(F44,AGE!F:J,5,FALSE)","v":1920}]
[20,10,1,"20101","Cross Triathlon","Jeune 6-9","Natation",50,{"$f":"H45*1.1","v":55.000000000000007},{"$f":"H45*0.9","v":45},110,"Sec/100m",{"$f":"IF(L45=\"Sec/100m\",((K45)/60/100),(IF(L45=\"Km/h\",60/K45/1000,(IF(L45=\"Min/km\",K45/1000,\"\")))))","v":1.8333333333333333E-2},{"$f":"H45*M45","v":0.91666666666666663},{"$f":"N45*1.25","v":1.1458333333333333},{"$f":"N45*1.4","v":1.2833333333333332},{"$f":"O41","v":83.125},{"$f":"N45/M45","v":50},{"$f":"O45/M45","v":62.499999999999993},{"$f":"P45/M45","v":70},{"$f":"+R45/2","v":25},{"$f":"VLOOKUP(F45,AGE!F:J,4,FALSE)","v":2013},{"$f":"VLOOKUP(F45,AGE!F:J,5,FALSE)","v":2010}]
[20,10,2,"20102","Cross Triathlon","Jeune 6-9","Cyclisme",1000,{"$f":"H46*1.1","v":1100},{"$f":"H46*0.9","v":900},15,"Km/h",{"$f":"IF(L46=\"Sec/100m\",((K46)/60/100),(IF(L46=\"Km/h\",60/K46/1000,(IF(L46=\"Min/km\",K46/1000,\"\")))))","v":4.0000000000000001E-3},{"$f":"H46*M46","v":4},{"$f":"N46*1.25","v":5},{"$f":"N46*1.4","v":5.6},{"$f":"O42","v":421.875},{"$f":"N46/M46","v":1000},{"$f":"O46/M46","v":1250},{"$f":"P46/M46","v":1399.9999999999998},{"$f":"+R46/2","v":500},{"$f":"VLOOKUP(F46,AGE!F:J,4,FALSE)","v":2013},{"$f":"VLOOKUP(F46,AGE!F:J,5,FALSE)","v":2010}]
[20,10,3,"20103","Cross Triathlon","Jeune 6-9","Course à pied",500,550,450,5,"Min/km",5.0000000000000001E-3,2.5,3.125,3.5,237.34687500000001,500,625,700,{"$f":"+R47/2","v":250},{"$f":"VLOOKUP(F47,AGE!F:J,4,FALSE)","v":2013},{"$f":"VLOOKUP(F47,AGE!F:J,5,FALSE)","v":2010}]
[20,10,4,"20104","Cross Triathlon","Jeune 6-9","Total",{"$f":"SUM(H45:H47)","v":1550},{"$f":"SUM(I45:I47)","v":1705},{"$f":"SUM(J45:J47)","v":1395},null,null,null,{"$f":"SUM(N45:N47)","v":7.416666666666667},{"$f":"SUM(O45:O47)","v":9.2708333333333321},null,{"$f":"SUM(Q45:Q47)","v":742.34687499999995},{"$f":"SUM(R45:R47)","v":1550},{"$f":"SUM(S45:S47)","v":1937.5},null,{"$f":"SUM(U45:U47)","v":775},{"$f":"VLOOKUP(F48,AGE!F:J,4,FALSE)","v":2013},{"$f":"VLOOKUP(F48,AGE!F:J,5,FALSE)","v":2010}]
[20,20,1,"20201","Cross Triathlon","Jeune 8-11","Natation",100,{"$f":"H49*1.1","v":110.00000000000001},{"$f":"H49*0.9","v":90},110,"Sec/100m",{"$f":"IF(L49=\"Sec/100m\",((K49)/60/100),(IF(L49=\"Km/h\",60/K49/1000,(IF(L49=\"Min/km\",K49/1000,\"\")))))","v":1.8333333333333333E-2},{"$f":"H49*M49","v":1.8333333333333333},{"$f":"N49*1.25","v":2.2916666666666665},{"$f":"N49*1.4","v":2.5666666666666664},{"$f":"O45","v":1.1458333333333333},{"$f":"N49/M49","v":100},{"$f":"O49/M49","v":124.99999999999999},{"$f":"P49/M49","v":140},{"$f":"S45+1","v":63.499999999999993},{"$f":"VLOOKUP(F49,AGE!F:J,4,FALSE)","v":2011},{"$f":"VLOOKUP(F49,AGE!F:J,5,FALSE)","v":2008}]
[20,20,2,"20202","Cross Triathlon","Jeune 8-11","Cyclisme",2000,{"$f":"H50*1.1","v":2200},{"$f":"H50*0.9","v":1800},15,"Km/h",{"$f":"IF(L50=\"Sec/100m\",((K50)/60/100),(IF(L50=\"Km/h\",60/K50/1000,(IF(L50=\"Min/km\",K50/1000,\"\")))))","v":4.0000000000000001E-3},{"$f":"H50*M50","v":8},{"$f":"N50*1.25","v":10},{"$f":"N50*1.4","v":11.2},{"$f":"O46","v":5},{"$f":"N50/M50","v":2000},{"$f":"O50/M50","v":2500},{"$f":"P50/M50","v":2799.9999999999995},{"$f":"S46+1","v":1251},{"$f":"VLOOKUP(F50,AGE!F:J,4,FALSE)","v":2011},{"$f":"VLOOKUP(F50,AGE!F:J,5,FALSE)","v":2008}]
[20,20,3,"20203","Cross Triathlon","Jeune 8-11","Course à pied",1000,1100,900,5,"Min/km",5.0000000000000001E-3,5,6.25,7,3.125,1000,1250,1400,{"$f":"S47+1","v":626},{"$f":"VLOOKUP(F51,AGE!F:J,4,FALSE)","v":2011},{"$f":"VLOOKUP(F51,AGE!F:J,5,FALSE)","v":2008}]
[20,20,4,"20204","Cross Triathlon","Jeune 8-11","Total",{"$f":"SUM(H49:H51)","v":3100},{"$f":"SUM(I49:I51)","v":3410},{"$f":"SUM(J49:J51)","v":2790},null,null,null,{"$f":"SUM(N49:N51)","v":14.833333333333334},{"$f":"SUM(O49:O51)","v":18.541666666666664},null,{"$f":"SUM(Q49:Q51)","v":9.2708333333333321},{"$f":"SUM(R49:R51)","v":3100},{"$f":"SUM(S49:S51)","v":3875},null,{"$f":"SUM(U49:U51)","v":1940.5},{"$f":"VLOOKUP(F52,AGE!F:J,4,FALSE)","v":2011},{"$f":"VLOOKUP(F52,AGE!F:J,5,FALSE)","v":2008}]
[20,30,1,"20301","Cross Triathlon","Jeune 10-13","Natation",200,{"$f":"H53*1.1","v":220.00000000000003},{"$f":"H53*0.9","v":180},110,"Sec/100m",{"$f":"IF(L53=\"Sec/100m\",((K53)/60/100),(IF(L53=\"Km/h\",60/K53/1000,(IF(L53=\"Min/km\",K53/1000,\"\")))))","v":1.8333333333333333E-2},{"$f":"H53*M53","v":3.6666666666666665},{"$f":"N53*1.25","v":4.583333333333333},{"$f":"N53*1.4","v":5.1333333333333329},{"$f":"O49","v":2.2916666666666665},{"$f":"N53/M53","v":200},{"$f":"O53/M53","v":249.99999999999997},{"$f":"P53/M53","v":280},{"$f":"S49+1","v":125.99999999999999},{"$f":"VLOOKUP(F53,AGE!F:J,4,FALSE)","v":2009},{"$f":"VLOOKUP(F53,AGE!F:J,5,FALSE)","v":2006}]
[20,30,2,"20302","Cross Triathlon","Jeune 10-13","Cyclisme",4000,{"$f":"H54*1.1","v":4400},{"$f":"H54*0.9","v":3600},15,"Km/h",{"$f":"IF(L54=\"Sec/100m\",((K54)/60/100),(IF(L54=\"Km/h\",60/K54/1000,(IF(L54=\"Min/km\",K54/1000,\"\")))))","v":4.0000000000000001E-3},{"$f":"H54*M54","v":16},{"$f":"N54*1.25","v":20},{"$f":"N54*1.4","v":22.4},{"$f":"O50","v":10},{"$f":"N54/M54","v":4000},{"$f":"O54/M54","v":5000},{"$f":"P54/M54","v":5599.9999999999991},{"$f":"S50+1","v":2501},{"$f":"VLOOKUP(F54,AGE!F:J,4,FALSE)","v":2009},{"$f":"VLOOKUP(F54,AGE!F:J,5,FALSE)","v":2006}]
[20,30,3,"20303","Cross Triathlon","Jeune 10-13","Course à pied",1500,1650.0000000000002,1350,5,"Min/km",5.0000000000000001E-3,7.5,9.375,10.5,6.25,1500,1875,2100,{"$f":"S51+1","v":1251},{"$f":"VLOOKUP(F55,AGE!F:J,4,FALSE)","v":2009},{"$f":"VLOOKUP(F55,AGE!F:J,5,FALSE)","v":2006}]
[20,30,4,"20304","Cross Triathlon","Jeune 10-13","Total",{"$f":"SUM(H53:H55)","v":5700},{"$f":"SUM(I53:I55)","v":6270},{"$f":"SUM(J53:J55)","v":5130},null,null,null,{"$f":"SUM(N53:N55)","v":27.166666666666668},{"$f":"SUM(O53:O55)","v":33.958333333333329},null,{"$f":"SUM(Q53:Q55)","v":18.541666666666664},{"$f":"SUM(R53:R55)","v":5700},{"$f":"SUM(S53:S55)","v":7125},null,{"$f":"SUM(U53:U55)","v":3878},{"$f":"VLOOKUP(F56,AGE!F:J,4,FALSE)","v":2009},{"$f":"VLOOKUP(F56,AGE!F:J,5,FALSE)","v":2006}]
[20,40,1,"20401","Cross Triathlon","Jeune 12-19","Natation",300,{"$f":"H57*1.1","v":330},{"$f":"H57*0.9","v":270},110,"Sec/100m",{"$f":"IF(L57=\"Sec/100m\",((K57)/60/100),(IF(L57=\"Km/h\",60/K57/1000,(IF(L57=\"Min/km\",K57/1000,\"\")))))","v":1.8333333333333333E-2},{"$f":"H57*M57","v":5.5},{"$f":"N57*1.25","v":6.875},{"$f":"N57*1.4","v":7.6999999999999993},{"$f":"O53","v":4.583333333333333},{"$f":"N57/M57","v":300},{"$f":"O57/M57","v":375},{"$f":"P57/M57","v":419.99999999999994},{"$f":"S53+1","v":250.99999999999997},{"$f":"VLOOKUP(F57,AGE!F:J,4,FALSE)","v":2007},{"$f":"VLOOKUP(F57,AGE!F:J,5,FALSE)","v":2000}]
[20,40,2,"20402","Cross Triathlon","Jeune 12-19","Cyclisme",6000,{"$f":"H58*1.1","v":6600.0000000000009},{"$f":"H58*0.9","v":5400},15,"Km/h",{"$f":"IF(L58=\"Sec/100m\",((K58)/60/100),(IF(L58=\"Km/h\",60/K58/1000,(IF(L58=\"Min/km\",K58/1000,\"\")))))","v":4.0000000000000001E-3},{"$f":"H58*M58","v":24},{"$f":"N58*1.25","v":30},{"$f":"N58*1.4","v":33.599999999999994},{"$f":"O54","v":20},{"$f":"N58/M58","v":6000},{"$f":"O58/M58","v":7500},{"$f":"P58/M58","v":8399.9999999999982},{"$f":"S54+1","v":5001},{"$f":"VLOOKUP(F58,AGE!F:J,4,FALSE)","v":2007},{"$f":"VLOOKUP(F58,AGE!F:J,5,FALSE)","v":2000}]
[20,40,3,"20403","Cross Triathlon","Jeune 12-19","Course à pied",2000,2200,1800,5,"Min/km",5.0000000000000001E-3,10,12.5,14,9.375,2000,2500,2800,{"$f":"S55+1","v":1876},{"$f":"VLOOKUP(F59,AGE!F:J,4,FALSE)","v":2007},{"$f":"VLOOKUP(F59,AGE!F:J,5,FALSE)","v":2000}]
[20,40,4,"20404","Cross Triathlon","Jeune 12-19","Total",{"$f":"SUM(H57:H59)","v":8300},{"$f":"SUM(I57:I59)","v":9130},{"$f":"SUM(J57:J59)","v":7470},null,null,null,{"$f":"SUM(N57:N59)","v":39.5},{"$f":"SUM(O57:O59)","v":49.375},null,{"$f":"SUM(Q57:Q59)","v":33.958333333333329},{"$f":"SUM(R57:R59)","v":8300},{"$f":"SUM(S57:S59)","v":10375},null,{"$f":"SUM(U57:U59)","v":7128},{"$f":"VLOOKUP(F60,AGE!F:J,4,FALSE)","v":2007},{"$f":"VLOOKUP(F60,AGE!F:J,5,FALSE)","v":2000}]
[20,50,1,"20501","Cross Triathlon","Distance XS","Natation",250,{"$f":"H61*1.1","v":275},{"$f":"H61*0.9","v":225},105,"Sec/100m",{"$f":"IF(L61=\"Sec/100m\",((K61)/60/100),(IF(L61=\"Km/h\",60/K61/1000,(IF(L61=\"Min/km\",K61/1000,\"\")))))","v":1.7500000000000002E-2},{"$f":"H61*M61","v":4.375},{"$f":"N61*1.25","v":5.46875},{"$f":"N61*1.4","v":6.125},{"$f":"O57","v":6.875},{"$f":"N61/M61","v":249.99999999999997},{"$f":"O61/M61","v":312.49999999999994},{"$f":"P61/M61","v":349.99999999999994},{"$f":"S57+1","v":376},{"$f":"VLOOKUP(F61,AGE!F:J,4,FALSE)","v":2007},{"$f":"VLOOKUP(F61,AGE!F:J,5,FALSE)","v":1920}]
[20,50,2,"20502","Cross Triathlon","Distance XS","Cyclisme",5500,{"$f":"H62*1.1","v":6050.0000000000009},{"$f":"H62*0.9","v":4950},15,"Km/h",{"$f":"IF(L62=\"Sec/100m\",((K62)/60/100),(IF(L62=\"Km/h\",60/K62/1000,(IF(L62=\"Min/km\",K62/1000,\"\")))))","v":4.0000000000000001E-3},{"$f":"H62*M62","v":22},{"$f":"N62*1.25","v":27.5},30.799999999999997,{"$f":"O58","v":30},{"$f":"N62/M62","v":5500},{"$f":"O62/M62","v":6875},{"$f":"P62/M62","v":7699.9999999999991},{"$f":"S58+1","v":7501},{"$f":"VLOOKUP(F62,AGE!F:J,4,FALSE)","v":2007},{"$f":"VLOOKUP(F62,AGE!F:J,5,FALSE)","v":1920}]
[20,50,3,"20503","Cross Triathlon","Distance XS","Course à pied",2000,2200,1800,4.5,"Min/km",4.4999999999999997E-3,9,11.25,12.6,12.5,2000.0000000000002,2500,2800,{"$f":"S59+1","v":2501},{"$f":"VLOOKUP(F63,AGE!F:J,4,FALSE)","v":2007},{"$f":"VLOOKUP(F63,AGE!F:J,5,FALSE)","v":1920}]
[20,50,4,"20504","Cross Triathlon","Distance XS","Total",{"$f":"SUM(H61:H63)","v":7750},{"$f":"SUM(I61:I63)","v":8525},{"$f":"SUM(J61:J63)","v":6975},null,null,null,{"$f":"SUM(N61:N63)","v":35.375},{"$f":"SUM(O61:O63)","v":44.21875},null,{"$f":"SUM(Q61:Q63)","v":49.375},{"$f":"SUM(R61:R63)","v":7750},{"$f":"SUM(S61:S63)","v":9687.5},null,{"$f":"SUM(U61:U63)","v":10378},{"$f":"VLOOKUP(F64,AGE!F:J,4,FALSE)","v":2007},{"$f":"VLOOKUP(F64,AGE!F:J,5,FALSE)","v":1920}]
[20,60,1,"20601","Cross Triathlon","Distance S","Natation",500,{"$f":"H65*1.1","v":550},{"$f":"H65*0.9","v":450},105,"Sec/100m",{"$f":"IF(L65=\"Sec/100m\",((K65)/60/100),(IF(L65=\"Km/h\",60/K65/1000,(IF(L65=\"Min/km\",K65/1000,\"\")))))","v":1.7500000000000002E-2},{"$f":"H65*M65","v":8.75},{"$f":"N65*1.25","v":10.9375},{"$f":"N65*1.4","v":12.25},{"$f":"O61","v":5.46875},{"$f":"N65/M65","v":499.99999999999994},{"$f":"O65/M65","v":624.99999999999989},{"$f":"P65/M65","v":699.99999999999989},{"$f":"S61+1","v":313.49999999999994},{"$f":"VLOOKUP(F65,AGE!F:J,4,FALSE)","v":2003},{"$f":"VLOOKUP(F65,AGE!F:J,5,FALSE)","v":1920}]
[20,60,2,"20602","Cross Triathlon","Distance S","Cyclisme",11000,{"$f":"H66*1.1","v":12100.000000000002},{"$f":"H66*0.9","v":9900},15,"Km/h",{"$f":"IF(L66=\"Sec/100m\",((K66)/60/100),(IF(L66=\"Km/h\",60/K66/1000,(IF(L66=\"Min/km\",K66/1000,\"\")))))","v":4.0000000000000001E-3},{"$f":"H66*M66","v":44},{"$f":"N66*1.25","v":55},61.599999999999994,{"$f":"O62","v":27.5},{"$f":"N66/M66","v":11000},{"$f":"O66/M66","v":13750},{"$f":"P66/M66","v":15399.999999999998},{"$f":"S62+1","v":6876},{"$f":"VLOOKUP(F66,AGE!F:J,4,FALSE)","v":2003},{"$f":"VLOOKUP(F66,AGE!F:J,5,FALSE)","v":1920}]
[20,60,3,"20603","Cross Triathlon","Distance S","Course à pied",4000,4400,3600,4.5,"Min/km",4.4999999999999997E-3,18,22.5,25.2,11.25,4000.0000000000005,5000,5600,{"$f":"S63+1","v":2501},{"$f":"VLOOKUP(F67,AGE!F:J,4,FALSE)","v":2003},{"$f":"VLOOKUP(F67,AGE!F:J,5,FALSE)","v":1920}]
[20,60,4,"20604","Cross Triathlon","Distance S","Total",{"$f":"SUM(H65:H67)","v":15500},{"$f":"SUM(I65:I67)","v":17050},{"$f":"SUM(J65:J67)","v":13950},null,null,null,{"$f":"SUM(N65:N67)","v":70.75},{"$f":"SUM(O65:O67)","v":88.4375},null,{"$f":"SUM(Q65:Q67)","v":44.21875},{"$f":"SUM(R65:R67)","v":15500},{"$f":"SUM(S65:S67)","v":19375},null,{"$f":"SUM(U65:U67)","v":9690.5},{"$f":"VLOOKUP(F68,AGE!F:J,4,FALSE)","v":2003},{"$f":"VLOOKUP(F68,AGE!F:J,5,FALSE)","v":1920}]
[20,70,1,"20701","Cross Triathlon","Distance M","Natation",1000,{"$f":"H69*1.1","v":1100},{"$f":"H69*0.9","v":900},105,"Sec/100m",{"$f":"IF(L69=\"Sec/100m\",((K69)/60/100),(IF(L69=\"Km/h\",60/K69/1000,(IF(L69=\"Min/km\",K69/1000,\"\")))))","v":1.7500000000000002E-2},{"$f":"H69*M69","v":17.5},{"$f":"N69*1.25","v":21.875},{"$f":"N69*1.4","v":24.5},{"$f":"O65","v":10.9375},{"$f":"N69/M69","v":999.99999999999989},{"$f":"O69/M69","v":1249.9999999999998},{"$f":"P69/M69","v":1399.9999999999998},{"$f":"S65+1","v":625.99999999999989},{"$f":"VLOOKUP(F69,AGE!F:J,4,FALSE)","v":2001},{"$f":"VLOOKUP(F69,AGE!F:J,5,FALSE)","v":1920}]
[20,70,2,{"$f":"CONCATENATE(A70,B70,C70)","v":"20702"},"Cross Triathlon","Distance M","Cyclisme",22000,{"$f":"H70*1.1","v":24200.000000000004},{"$f":"H70*0.9","v":19800},15,"Km/h",{"$f":"IF(L70=\"Sec/100m\",((K70)/60/100),(IF(L70=\"Km/h\",60/K70/1000,(IF(L70=\"Min/km\",K70/1000,\"\")))))","v":4.0000000000000001E-3},{"$f":"H70*M70","v":88},{"$f":"N70*1.25","v":110},123.19999999999999,{"$f":"O66","v":55},{"$f":"N70/M70","v":22000},{"$f":"O70/M70","v":27500},{"$f":"P70/M70","v":30799.999999999996},{"$f":"S66+1","v":13751},{"$f":"VLOOKUP(F70,AGE!F:J,4,FALSE)","v":2001},{"$f":"VLOOKUP(F70,AGE!F:J,5,FALSE)","v":1920}]
[20,70,3,"20703","Cross Triathlon","Distance M","Course à pied",8000,8800,7200,4.5,"Min/km",4.4999999999999997E-3,36,45,50.4,22.5,8000.0000000000009,10000,11200,{"$f":"S67+1","v":5001},{"$f":"VLOOKUP(F71,AGE!F:J,4,FALSE)","v":2001},{"$f":"VLOOKUP(F71,AGE!F:J,5,FALSE)","v":1920}]
[20,70,4,"20704","Cross Triathlon","Distance M","Total",{"$f":"SUM(H69:H71)","v":31000},{"$f":"SUM(I69:I71)","v":34100},{"$f":"SUM(J69:J71)","v":27900},null,null,null,{"$f":"SUM(N69:N71)","v":141.5},{"$f":"SUM(O69:O71)","v":176.875},null,{"$f":"SUM(Q69:Q71)","v":88.4375},{"$f":"SUM(R69:R71)","v":31000},{"$f":"SUM(S69:S71)","v":38750},null,{"$f":"SUM(U69:U71)","v":19378},{"$f":"VLOOKUP(F72,AGE!F:J,4,FALSE)","v":2001},{"$f":"VLOOKUP(F72,AGE!F:J,5,FALSE)","v":1920}]
[20,80,1,"20801","Cross Triathlon","Distance L","Natation",2000,{"$f":"H73*1.1","v":2200},{"$f":"H73*0.9","v":1800},105,"Sec/100m",{"$f":"IF(L73=\"Sec/100m\",((K73)/60/100),(IF(L73=\"Km/h\",60/K73/1000,(IF(L73=\"Min/km\",K73/1000,\"\")))))","v":1.7500000000000002E-2},{"$f":"H73*M73","v":35},{"$f":"N73*1.25","v":43.75},null,{"$f":"O69","v":21.875},{"$f":"N73/M73","v":1999.9999999999998},{"$f":"O73/M73","v":2499.9999999999995},{"$f":"P73/M73","v":0},{"$f":"S69+1","v":1250.9999999999998},{"$f":"VLOOKUP(F73,AGE!F:J,4,FALSE)","v":2001},{"$f":"VLOOKUP(F73,AGE!F:J,5,FALSE)","v":1920}]
[20,80,2,"20802","Cross Triathlon","Distance L","Cyclisme",44000,{"$f":"H74*1.1","v":48400.000000000007},{"$f":"H74*0.9","v":39600},15,"Km/h",{"$f":"IF(L74=\"Sec/100m\",((K74)/60/100),(IF(L74=\"Km/h\",60/K74/1000,(IF(L74=\"Min/km\",K74/1000,\"\")))))","v":4.0000000000000001E-3},{"$f":"H74*M74","v":176},{"$f":"N74*1.25","v":220},null,{"$f":"O70","v":110},{"$f":"N74/M74","v":44000},{"$f":"O74/M74","v":55000},{"$f":"P74/M74","v":0},{"$f":"S70+1","v":27501},{"$f":"VLOOKUP(F74,AGE!F:J,4,FALSE)","v":2001},{"$f":"VLOOKUP(F74,AGE!F:J,5,FALSE)","v":1920}]
[20,80,3,"20803","Cross Triathlon","Distance L","Course à pied",16000,17600,14400,4.5,"Min/km",4.4999999999999997E-3,72,90,null,45,16000.000000000002,20000,0,{"$f":"S71+1","v":10001},{"$f":"VLOOKUP(F75,AGE!F:J,4,FALSE)","v":2001},{"$f":"VLOOKUP(F75,AGE!F:J,5,FALSE)","v":1920}]
[20,80,4,"20804","Cross Triathlon","Distance L","Total",{"$f":"SUM(H73:H75)","v":62000},{"$f":"SUM(I73:I75)","v":68200},{"$f":"SUM(J73:J75)","v":55800},null,null,null,{"$f":"SUM(N73:N75)","v":283},{"$f":"SUM(O73:O75)","v":353.75},null,{"$f":"SUM(Q73:Q75)","v":176.875},{"$f":"SUM(R73:R75)","v":62000},{"$f":"SUM(S73:S75)","v":77500},null,{"$f":"SUM(U73:U75)","v":38753},{"$f":"VLOOKUP(F76,AGE!F:J,4,FALSE)","v":2001},{"$f":"VLOOKUP(F76,AGE!F:J,5,FALSE)","v":1920}]
[20,90,1,"20901","Cross Triathlon","Distance XL","Natation",3000,{"$f":"H77*1.1","v":3300.0000000000005},{"$f":"H77*0.9","v":2700},105,"Sec/100m",{"$f":"IF(L77=\"Sec/100m\",((K77)/60/100),(IF(L77=\"Km/h\",60/K77/1000,(IF(L77=\"Min/km\",K77/1000,\"\")))))","v":1.7500000000000002E-2},{"$f":"H77*M77","v":52.500000000000007},{"$f":"N77*1.25","v":65.625000000000014},null,{"$f":"O73","v":43.75},{"$f":"N77/M77","v":3000},{"$f":"O77/M77","v":3750.0000000000005},{"$f":"P77/M77","v":0},{"$f":"S73+1","v":2500.9999999999995},{"$f":"VLOOKUP(F77,AGE!F:J,4,FALSE)","v":2001},{"$f":"VLOOKUP(F77,AGE!F:J,5,FALSE)","v":1920}]
[20,90,2,"20902","Cross Triathlon","Distance XL","Cyclisme",66000,{"$f":"H78*1.1","v":72600},{"$f":"H78*0.9","v":59400},15,"Km/h",{"$f":"IF(L78=\"Sec/100m\",((K78)/60/100),(IF(L78=\"Km/h\",60/K78/1000,(IF(L78=\"Min/km\",K78/1000,\"\")))))","v":4.0000000000000001E-3},{"$f":"H78*M78","v":264},{"$f":"N78*1.25","v":330},null,{"$f":"O74","v":220},{"$f":"N78/M78","v":66000},{"$f":"O78/M78","v":82500},{"$f":"P78/M78","v":0},{"$f":"S74+1","v":55001},{"$f":"VLOOKUP(F78,AGE!F:J,4,FALSE)","v":2001},{"$f":"VLOOKUP(F78,AGE!F:J,5,FALSE)","v":1920}]
[20,90,3,"20903","Cross Triathlon","Distance XL","Course à pied",24000,26400.000000000004,21600,4.5,"Min/km",4.4999999999999997E-3,107.99999999999999,134.99999999999997,null,90,24000,29999.999999999996,0,{"$f":"S75+1","v":20001},{"$f":"VLOOKUP(F79,AGE!F:J,4,FALSE)","v":2001},{"$f":"VLOOKUP(F79,AGE!F:J,5,FALSE)","v":1920}]
[20,90,4,"20904","Cross Triathlon","Distance XL","Total",{"$f":"SUM(H77:H79)","v":93000},{"$f":"SUM(I77:I79)","v":102300},{"$f":"SUM(J77:J79)","v":83700},null,null,null,{"$f":"SUM(N77:N79)","v":424.5},{"$f":"SUM(O77:O79)","v":530.625},null,{"$f":"SUM(Q77:Q79)","v":353.75},{"$f":"SUM(R77:R79)","v":93000},{"$f":"SUM(S77:S79)","v":116250},null,{"$f":"SUM(U77:U79)","v":77503},{"$f":"VLOOKUP(F80,AGE!F:J,4,FALSE)","v":2001},{"$f":"VLOOKUP(F80,AGE!F:J,5,FALSE)","v":1920}]
[30,10,1,"30101","Duathlon","Jeune 6-9","Course à pied",250,{"$f":"H81*1.1","v":275},{"$f":"H81*0.9","v":225},5,"Min/km",{"$f":"IF(L81=\"Sec/100m\",((K81)/60/100),(IF(L81=\"Km/h\",60/K81/1000,(IF(L81=\"Min/km\",K81/1000,\"\")))))","v":5.0000000000000001E-3},{"$f":"H81*M81","v":1.25},{"$f":"N81*1.25","v":1.5625},{"$f":"N81*1.4","v":1.75},{"$f":"O77","v":65.625000000000014},{"$f":"N81/M81","v":250},{"$f":"O81/M81","v":312.5},{"$f":"P81/M81","v":350},{"$f":"+R81/2","v":125},{"$f":"VLOOKUP(F81,AGE!F:J,4,FALSE)","v":2013},{"$f":"VLOOKUP(F81,AGE!F:J,5,FALSE)","v":2010}]
[30,10,2,"30102","Duathlon","Jeune 6-9","Cyclisme",1000,{"$f":"H82*1.1","v":1100},{"$f":"H82*0.9","v":900},15,"Km/h",4.0000000000000001E-3,{"$f":"H82*M82","v":4},{"$f":"N82*1.25","v":5},{"$f":"N82*1.4","v":5.6},{"$f":"O78","v":330},{"$f":"N82/M82","v":1000},{"$f":"O82/M82","v":1250},{"$f":"P82/M82","v":1399.9999999999998},{"$f":"+R82/2","v":500},{"$f":"VLOOKUP(F82,AGE!F:J,4,FALSE)","v":2013},{"$f":"VLOOKUP(F82,AGE!F:J,5,FALSE)","v":2010}]
[30,10,3,"30103","Duathlon","Jeune 6-9","Course à pied",250,275,225,5,"Min/km",5.0000000000000001E-3,1.25,1.5625,1.75,134.99999999999997,250,312.5,350,{"$f":"+R83/2","v":125},{"$f":"VLOOKUP(F83,AGE!F:J,4,FALSE)","v":2013},{"$f":"VLOOKUP(F83,AGE!F:J,5,FALSE)","v":2010}]
[30,10,4,"30104","Duathlon","Jeune 6-9","Total",{"$f":"SUM(H81:H83)","v":1500},{"$f":"SUM(I81:I83)","v":1650},{"$f":"SUM(J81:J83)","v":1350},null,null,"",{"$f":"SUM(N81:N83)","v":6.5},{"$f":"SUM(O81:O83)","v":8.125},null,{"$f":"SUM(Q81:Q83)","v":530.625},{"$f":"SUM(R81:R83)","v":1500},{"$f":"SUM(S81:S83)","v":1875},null,{"$f":"SUM(U81:U83)","v":750},{"$f":"VLOOKUP(F84,AGE!F:J,4,FALSE)","v":2013},{"$f":"VLOOKUP(F84,AGE!F:J,5,FALSE)","v":2010}]
[30,20,1,"30201","Duathlon","Jeune 8-11","Course à pied",500,{"$f":"H85*1.1","v":550},{"$f":"H85*0.9","v":450},5,"Min/km",5.0000000000000001E-3,{"$f":"H85*M85","v":2.5},{"$f":"N85*1.25","v":3.125},{"$f":"N85*1.4","v":3.5},{"$f":"O81","v":1.5625},{"$f":"N85/M85","v":500},{"$f":"O85/M85","v":625},{"$f":"P85/M85","v":700},{"$f":"S81+1","v":313.5},{"$f":"VLOOKUP(F85,AGE!F:J,4,FALSE)","v":2011},{"$f":"VLOOKUP(F85,AGE!F:J,5,FALSE)","v":2008}]
[30,20,2,"30202","Duathlon","Jeune 8-11","Cyclisme",2000,{"$f":"H86*1.1","v":2200},{"$f":"H86*0.9","v":1800},15,"Km/h",4.0000000000000001E-3,{"$f":"H86*M86","v":8},{"$f":"N86*1.25","v":10},{"$f":"N86*1.4","v":11.2},{"$f":"O82","v":5},{"$f":"N86/M86","v":2000},{"$f":"O86/M86","v":2500},{"$f":"P86/M86","v":2799.9999999999995},{"$f":"S82+1","v":1251},{"$f":"VLOOKUP(F86,AGE!F:J,4,FALSE)","v":2011},{"$f":"VLOOKUP(F86,AGE!F:J,5,FALSE)","v":2008}]
[30,20,3,"30203","Duathlon","Jeune 8-11","Course à pied",500,550,450,5,"Min/km",5.0000000000000001E-3,2.5,3.125,3.5,1.5625,500,625,700,{"$f":"S83+1","v":313.5},{"$f":"VLOOKUP(F87,AGE!F:J,4,FALSE)","v":2011},{"$f":"VLOOKUP(F87,AGE!F:J,5,FALSE)","v":2008}]
[30,20,4,"30204","Duathlon","Jeune 8-11","Total",{"$f":"SUM(H85:H87)","v":3000},{"$f":"SUM(I85:I87)","v":3300},{"$f":"SUM(J85:J87)","v":2700},null,null,"",{"$f":"SUM(N85:N87)","v":13},{"$f":"SUM(O85:O87)","v":16.25},null,{"$f":"SUM(Q85:Q87)","v":8.125},{"$f":"SUM(R85:R87)","v":3000},{"$f":"SUM(S85:S87)","v":3750},null,{"$f":"SUM(U85:U87)","v":1878},{"$f":"VLOOKUP(F88,AGE!F:J,4,FALSE)","v":2011},{"$f":"VLOOKUP(F88,AGE!F:J,5,FALSE)","v":2008}]
[30,30,1,"30301","Duathlon","Jeune 10-13","Course à pied",750,{"$f":"H89*1.1","v":825.00000000000011},{"$f":"H89*0.9","v":675},5,"Min/km",5.0000000000000001E-3,{"$f":"H89*M89","v":3.75},{"$f":"N89*1.25","v":4.6875},{"$f":"N89*1.4","v":5.25},{"$f":"O85","v":3.125},{"$f":"N89/M89","v":750},{"$f":"O89/M89","v":937.5},{"$f":"P89/M89","v":1050},{"$f":"S85+1","v":626},{"$f":"VLOOKUP(F89,AGE!F:J,4,FALSE)","v":2009},{"$f":"VLOOKUP(F89,AGE!F:J,5,FALSE)","v":2006}]
[30,30,2,"30302","Duathlon","Jeune 10-13","Cyclisme",5000,{"$f":"H90*1.1","v":5500},{"$f":"H90*0.9","v":4500},15,"Km/h",4.0000000000000001E-3,{"$f":"H90*M90","v":20},{"$f":"N90*1.25","v":25},{"$f":"N90*1.4","v":28},{"$f":"O86","v":10},{"$f":"N90/M90","v":5000},{"$f":"O90/M90","v":6250},{"$f":"P90/M90","v":7000},{"$f":"S86+1","v":2501},{"$f":"VLOOKUP(F90,AGE!F:J,4,FALSE)","v":2009},{"$f":"VLOOKUP(F90,AGE!F:J,5,FALSE)","v":2006}]
[30,30,3,"30303","Duathlon","Jeune 10-13","Course à pied",750,825.00000000000011,675,5,"Min/km",5.0000000000000001E-3,3.75,4.6875,5.25,3.125,750,937.5,1050,{"$f":"S87+1","v":626},{"$f":"VLOOKUP(F91,AGE!F:J,4,FALSE)","v":2009},{"$f":"VLOOKUP(F91,AGE!F:J,5,FALSE)","v":2006}]
[30,30,4,"30304","Duathlon","Jeune 10-13","Total",{"$f":"SUM(H89:H91)","v":6500},{"$f":"SUM(I89:I91)","v":7150},{"$f":"SUM(J89:J91)","v":5850},null,null,"",{"$f":"SUM(N89:N91)","v":27.5},{"$f":"SUM(O89:O91)","v":34.375},null,{"$f":"SUM(Q89:Q91)","v":16.25},{"$f":"SUM(R89:R91)","v":6500},{"$f":"SUM(S89:S91)","v":8125},null,{"$f":"SUM(U89:U91)","v":3753},{"$f":"VLOOKUP(F92,AGE!F:J,4,FALSE)","v":2009},{"$f":"VLOOKUP(F92,AGE!F:J,5,FALSE)","v":2006}]
[30,40,1,"30401","Duathlon","Jeune 12-19","Course à pied",1000,{"$f":"H93*1.1","v":1100},{"$f":"H93*0.9","v":900},5,"Min/km",{"$f":"IF(L93=\"Sec/100m\",((K93)/60/100),(IF(L93=\"Km/h\",60/K93/1000,(IF(L93=\"Min/km\",K93/1000,\"\")))))","v":5.0000000000000001E-3},{"$f":"H93*M93","v":5},{"$f":"N93*1.25","v":6.25},{"$f":"N93*1.4","v":7},{"$f":"O89","v":4.6875},{"$f":"N93/M93","v":1000},{"$f":"O93/M93","v":1250},{"$f":"P93/M93","v":1400},{"$f":"S89+1","v":938.5},{"$f":"VLOOKUP(F93,AGE!F:J,4,FALSE)","v":2007},{"$f":"VLOOKUP(F93,AGE!F:J,5,FALSE)","v":2000}]
[30,40,2,"30402","Duathlon","Jeune 12-19","Cyclisme",6000,{"$f":"H94*1.1","v":6600.0000000000009},{"$f":"H94*0.9","v":5400},15,"Km/h",4.0000000000000001E-3,{"$f":"H94*M94","v":24},{"$f":"N94*1.25","v":30},{"$f":"N94*1.4","v":33.599999999999994},{"$f":"O90","v":25},{"$f":"N94/M94","v":6000},{"$f":"O94/M94","v":7500},{"$f":"P94/M94","v":8399.9999999999982},{"$f":"S90+1","v":6251},{"$f":"VLOOKUP(F94,AGE!F:J,4,FALSE)","v":2007},{"$f":"VLOOKUP(F94,AGE!F:J,5,FALSE)","v":2000}]
[30,40,3,"30403","Duathlon","Jeune 12-19","Course à pied",1000,1100,900,5,"Min/km",{"$f":"IF(L95=\"Sec/100m\",((K95)/60/100),(IF(L95=\"Km/h\",60/K95/1000,(IF(L95=\"Min/km\",K95/1000,\"\")))))","v":5.0000000000000001E-3},5,6.25,7,4.6875,1000,1250,1400,{"$f":"S91+1","v":938.5},{"$f":"VLOOKUP(F95,AGE!F:J,4,FALSE)","v":2007},{"$f":"VLOOKUP(F95,AGE!F:J,5,FALSE)","v":2000}]
[30,40,4,"30404","Duathlon","Jeune 12-19","Total",{"$f":"SUM(H93:H95)","v":8000},{"$f":"SUM(I93:I95)","v":8800},{"$f":"SUM(J93:J95)","v":7200},null,null,"",{"$f":"SUM(N93:N95)","v":34},{"$f":"SUM(O93:O95)","v":42.5},null,{"$f":"SUM(Q93:Q95)","v":34.375},{"$f":"SUM(R93:R95)","v":8000},{"$f":"SUM(S93:S95)","v":10000},null,{"$f":"SUM(U93:U95)","v":8128},{"$f":"VLOOKUP(F96,AGE!F:J,4,FALSE)","v":2007},{"$f":"VLOOKUP(F96,AGE!F:J,5,FALSE)","v":2000}]
[30,50,1,"30501","Duathlon","Distance XS","Course à pied",2500,{"$f":"H97*1.1","v":2750},{"$f":"H97*0.9","v":2250},4.5,"Min/km",{"$f":"IF(L97=\"Sec/100m\",((K97)/60/100),(IF(L97=\"Km/h\",60/K97/1000,(IF(L97=\"Min/km\",K97/1000,\"\")))))","v":4.4999999999999997E-3},{"$f":"H97*M97","v":11.25},{"$f":"N97*1.25","v":14.0625},{"$f":"N97*1.4","v":15.749999999999998},{"$f":"O93","v":6.25},{"$f":"N97/M97","v":2500},{"$f":"O97/M97","v":3125.0000000000005},{"$f":"P97/M97","v":3500},{"$f":"S93+1","v":1251},{"$f":"VLOOKUP(F97,AGE!F:J,4,FALSE)","v":2007},{"$f":"VLOOKUP(F97,AGE!F:J,5,FALSE)","v":1920}]
[30,50,2,"30502","Duathlon","Distance XS","Cyclisme",10000,{"$f":"H98*1.1","v":11000},{"$f":"H98*0.9","v":9000},15,"Km/h",4.0000000000000001E-3,{"$f":"H98*M98","v":40},{"$f":"N98*1.25","v":50},56,{"$f":"O94","v":30},{"$f":"N98/M98","v":10000},{"$f":"O98/M98","v":12500},{"$f":"P98/M98","v":14000},{"$f":"S94+1","v":7501},{"$f":"VLOOKUP(F98,AGE!F:J,4,FALSE)","v":2007},{"$f":"VLOOKUP(F98,AGE!F:J,5,FALSE)","v":1920}]
[30,50,3,"30503","Duathlon","Distance XS","Course à pied",1250,1375,1125,4.5,"Min/km",4.4999999999999997E-3,5.625,7.03125,7.8749999999999991,6.25,1250,1562.5000000000002,1750,{"$f":"S95+1","v":1251},{"$f":"VLOOKUP(F99,AGE!F:J,4,FALSE)","v":2007},{"$f":"VLOOKUP(F99,AGE!F:J,5,FALSE)","v":1920}]
[30,50,4,"30504","Duathlon","Distance XS","Total",{"$f":"SUM(H97:H99)","v":13750},{"$f":"SUM(I97:I99)","v":15125},{"$f":"SUM(J97:J99)","v":12375},null,null,"",{"$f":"SUM(N97:N99)","v":56.875},{"$f":"SUM(O97:O99)","v":71.09375},null,{"$f":"SUM(Q97:Q99)","v":42.5},{"$f":"SUM(R97:R99)","v":13750},{"$f":"SUM(S97:S99)","v":17187.5},null,{"$f":"SUM(U97:U99)","v":10003},{"$f":"VLOOKUP(F100,AGE!F:J,4,FALSE)","v":2007},{"$f":"VLOOKUP(F100,AGE!F:J,5,FALSE)","v":1920}]
[30,60,1,"30601","Duathlon","Distance S","Course à pied",5000,{"$f":"H101*1.1","v":5500},{"$f":"H101*0.9","v":4500},4.5,"Min/km",4.4999999999999997E-3,{"$f":"H101*M101","v":22.5},{"$f":"N101*1.25","v":28.125},{"$f":"N101*1.4","v":31.499999999999996},{"$f":"O97","v":14.0625},{"$f":"N101/M101","v":5000},{"$f":"O101/M101","v":6250.0000000000009},{"$f":"P101/M101","v":7000},{"$f":"S97+1","v":3126.0000000000005},{"$f":"VLOOKUP(F101,AGE!F:J,4,FALSE)","v":2003},{"$f":"VLOOKUP(F101,AGE!F:J,5,FALSE)","v":1920}]
[30,60,2,"30602","Duathlon","Distance S","Cyclisme",20000,{"$f":"H102*1.1","v":22000},{"$f":"H102*0.9","v":18000},32,"Km/h",1.8749999999999999E-3,{"$f":"H102*M102","v":37.5},{"$f":"N102*1.25","v":46.875},52.5,{"$f":"O98","v":50},{"$f":"N102/M102","v":20000},{"$f":"O102/M102","v":25000},{"$f":"P102/M102","v":28000},{"$f":"S98+1","v":12501},{"$f":"VLOOKUP(F102,AGE!F:J,4,FALSE)","v":2003},{"$f":"VLOOKUP(F102,AGE!F:J,5,FALSE)","v":1920}]
[30,60,3,"30603","Duathlon","Distance S","Course à pied",2500,2750,2250,4.5,"Min/km",4.4999999999999997E-3,11.25,14.0625,15.749999999999998,7.03125,2500,3125.0000000000005,3500,{"$f":"S99+1","v":1563.5000000000002},{"$f":"VLOOKUP(F103,AGE!F:J,4,FALSE)","v":2003},{"$f":"VLOOKUP(F103,AGE!F:J,5,FALSE)","v":1920}]
[30,60,4,"30604","Duathlon","Distance S","Total",{"$f":"SUM(H101:H103)","v":27500},{"$f":"SUM(I101:I103)","v":30250},{"$f":"SUM(J101:J103)","v":24750},null,null,"",{"$f":"SUM(N101:N103)","v":71.25},{"$f":"SUM(O101:O103)","v":89.0625},null,{"$f":"SUM(Q101:Q103)","v":71.09375},{"$f":"SUM(R101:R103)","v":27500},{"$f":"SUM(S101:S103)","v":34375},null,{"$f":"SUM(U101:U103)","v":17190.5},{"$f":"VLOOKUP(F104,AGE!F:J,4,FALSE)","v":2003},{"$f":"VLOOKUP(F104,AGE!F:J,5,FALSE)","v":1920}]
[30,70,1,"30701","Duathlon","Distance M","Course à pied",10000,{"$f":"H105*1.1","v":11000},{"$f":"H105*0.9","v":9000},4.5,"Min/km",4.4999999999999997E-3,{"$f":"H105*M105","v":45},{"$f":"N105*1.25","v":56.25},{"$f":"N105*1.4","v":62.999999999999993},{"$f":"O101","v":28.125},{"$f":"N105/M105","v":10000},{"$f":"O105/M105","v":12500.000000000002},{"$f":"P105/M105","v":14000},{"$f":"S101+1","v":6251.0000000000009},{"$f":"VLOOKUP(F105,AGE!F:J,4,FALSE)","v":2001},{"$f":"VLOOKUP(F105,AGE!F:J,5,FALSE)","v":1920}]
[30,70,2,"30702","Duathlon","Distance M","Cyclisme",40000,{"$f":"H106*1.1","v":44000},{"$f":"H106*0.9","v":36000},32,"Km/h",1.8749999999999999E-3,{"$f":"H106*M106","v":75},{"$f":"N106*1.25","v":93.75},105,{"$f":"O102","v":46.875},{"$f":"N106/M106","v":40000},{"$f":"O106/M106","v":50000},{"$f":"P106/M106","v":56000},{"$f":"S102+1","v":25001},{"$f":"VLOOKUP(F106,AGE!F:J,4,FALSE)","v":2001},{"$f":"VLOOKUP(F106,AGE!F:J,5,FALSE)","v":1920}]
[30,70,3,"30703","Duathlon","Distance M","Course à pied",5000,5500,4500,4.5,"Min/km",4.4999999999999997E-3,22.5,28.125,31.499999999999996,14.0625,5000,6250.0000000000009,7000,{"$f":"S103+1","v":3126.0000000000005},{"$f":"VLOOKUP(F107,AGE!F:J,4,FALSE)","v":2001},{"$f":"VLOOKUP(F107,AGE!F:J,5,FALSE)","v":1920}]
[30,70,4,"30704","Duathlon","Distance M","Total",{"$f":"SUM(H105:H107)","v":55000},{"$f":"SUM(I105:I107)","v":60500},{"$f":"SUM(J105:J107)","v":49500},null,null,"",{"$f":"SUM(N105:N107)","v":142.5},{"$f":"SUM(O105:O107)","v":178.125},null,{"$f":"SUM(Q105:Q107)","v":89.0625},{"$f":"SUM(R105:R107)","v":55000},{"$f":"SUM(S105:S107)","v":68750},null,{"$f":"SUM(U105:U107)","v":34378},{"$f":"VLOOKUP(F108,AGE!F:J,4,FALSE)","v":2001},{"$f":"VLOOKUP(F108,AGE!F:J,5,FALSE)","v":1920}]
[30,80,1,"30801","Duathlon","Distance L","Course à pied",20000,{"$f":"H109*1.1","v":22000},{"$f":"H109*0.9","v":18000},4.5,"Min/km",4.4999999999999997E-3,{"$f":"H109*M109","v":90},{"$f":"N109*1.25","v":112.5},null,{"$f":"O105","v":56.25},{"$f":"N109/M109","v":20000},{"$f":"O109/M109","v":25000.000000000004},{"$f":"P109/M109","v":0},{"$f":"S105+1","v":12501.000000000002},{"$f":"VLOOKUP(F109,AGE!F:J,4,FALSE)","v":2001},{"$f":"VLOOKUP(F109,AGE!F:J,5,FALSE)","v":1920}]
[30,80,2,"30802","Duathlon","Distance L","Cyclisme",80000,{"$f":"H110*1.1","v":88000},{"$f":"H110*0.9","v":72000},32,"Km/h",1.8749999999999999E-3,{"$f":"H110*M110","v":150},{"$f":"N110*1.25","v":187.5},null,{"$f":"O106","v":93.75},{"$f":"N110/M110","v":80000},{"$f":"O110/M110","v":100000},{"$f":"P110/M110","v":0},{"$f":"S106+1","v":50001},{"$f":"VLOOKUP(F110,AGE!F:J,4,FALSE)","v":2001},{"$f":"VLOOKUP(F110,AGE!F:J,5,FALSE)","v":1920}]
[30,80,3,"30803","Duathlon","Distance L","Course à pied",10000,11000,9000,4.5,"Min/km",4.4999999999999997E-3,{"$f":"H111*M111","v":45},56.25,null,28.125,10000,12500.000000000002,0,{"$f":"S107+1","v":6251.0000000000009},{"$f":"VLOOKUP(F111,AGE!F:J,4,FALSE)","v":2001},{"$f":"VLOOKUP(F111,AGE!F:J,5,FALSE)","v":1920}]
[30,80,4,"30804","Duathlon","Distance L","Total",{"$f":"SUM(H109:H111)","v":110000},{"$f":"SUM(I109:I111)","v":121000},{"$f":"SUM(J109:J111)","v":99000},null,null,"",{"$f":"SUM(N109:N111)","v":285},{"$f":"SUM(O109:O111)","v":356.25},null,{"$f":"SUM(Q109:Q111)","v":178.125},{"$f":"SUM(R109:R111)","v":110000},{"$f":"SUM(S109:S111)","v":137500},null,{"$f":"SUM(U109:U111)","v":68753},{"$f":"VLOOKUP(F112,AGE!F:J,4,FALSE)","v":2001},{"$f":"VLOOKUP(F112,AGE!F:J,5,FALSE)","v":1920}]
[30,90,1,"30901","Duathlon","Distance XL","Course à pied",20000,{"$f":"H113*1.1","v":22000},{"$f":"H113*0.9","v":18000},4.5,"Min/km",4.4999999999999997E-3,{"$f":"H113*M113","v":90},{"$f":"N113*1.25","v":112.5},null,{"$f":"O109","v":112.5},{"$f":"N113/M113","v":20000},{"$f":"O113/M113","v":25000.000000000004},{"$f":"P113/M113","v":0},{"$f":"S109+1","v":25001.000000000004},{"$f":"VLOOKUP(F113,AGE!F:J,4,FALSE)","v":2001},{"$f":"VLOOKUP(F113,AGE!F:J,5,FALSE)","v":1920}]
[30,90,2,"30902","Duathlon","Distance XL","Cyclisme",120000,{"$f":"H114*1.1","v":132000},{"$f":"H114*0.9","v":108000},32,"Km/h",1.8749999999999999E-3,{"$f":"H114*M114","v":225},{"$f":"N114*1.25","v":281.25},null,{"$f":"O110","v":187.5},{"$f":"N114/M114","v":120000},{"$f":"O114/M114","v":150000},{"$f":"P114/M114","v":0},{"$f":"S110+1","v":100001},{"$f":"VLOOKUP(F114,AGE!F:J,4,FALSE)","v":2001},{"$f":"VLOOKUP(F114,AGE!F:J,5,FALSE)","v":1920}]
[30,90,3,"30903","Duathlon","Distance XL","Course à pied",20000,22000,18000,4.5,"Min/km",4.4999999999999997E-3,90,112.5,null,56.25,20000,25000.000000000004,0,{"$f":"S111+1","v":12501.000000000002},{"$f":"VLOOKUP(F115,AGE!F:J,4,FALSE)","v":2001},{"$f":"VLOOKUP(F115,AGE!F:J,5,FALSE)","v":1920}]
[30,90,4,"30904","Duathlon","Distance XL","Total",{"$f":"SUM(H113:H115)","v":160000},{"$f":"SUM(I113:I115)","v":176000},{"$f":"SUM(J113:J115)","v":144000},null,null,"",{"$f":"SUM(N113:N115)","v":405},{"$f":"SUM(O113:O115)","v":506.25},null,{"$f":"SUM(Q113:Q115)","v":356.25},{"$f":"SUM(R113:R115)","v":160000},{"$f":"SUM(S113:S115)","v":200000},null,{"$f":"SUM(U113:U115)","v":137503},{"$f":"VLOOKUP(F116,AGE!F:J,4,FALSE)","v":2001},{"$f":"VLOOKUP(F116,AGE!F:J,5,FALSE)","v":1920}]
[40,10,1,"40101","Cross Duathlon","Jeune 6-9","Course à pied",250,{"$f":"H117*1.1","v":275},{"$f":"H117*0.9","v":225},5,"Min/km",5.0000000000000001E-3,{"$f":"H117*M117","v":1.25},{"$f":"N117*1.25","v":1.5625},{"$f":"N117*1.4","v":1.75},null,{"$f":"N117/M117","v":250},{"$f":"O117/M117","v":312.5},{"$f":"P117/M117","v":350},{"$f":"+R117/2","v":125},{"$f":"VLOOKUP(F117,AGE!F:J,4,FALSE)","v":2013},{"$f":"VLOOKUP(F117,AGE!F:J,5,FALSE)","v":2010}]
[40,10,2,"40102","Cross Duathlon","Jeune 6-9","Vélo",1000,{"$f":"H118*1.1","v":1100},{"$f":"H118*0.9","v":900},15,"Km/h",4.0000000000000001E-3,{"$f":"H118*M118","v":4},{"$f":"N118*1.25","v":5},{"$f":"N118*1.4","v":5.6},null,{"$f":"N118/M118","v":1000},{"$f":"O118/M118","v":1250},{"$f":"P118/M118","v":1399.9999999999998},{"$f":"+R118/2","v":500},{"$f":"VLOOKUP(F118,AGE!F:J,4,FALSE)","v":2013},{"$f":"VLOOKUP(F118,AGE!F:J,5,FALSE)","v":2010}]
[40,10,3,"40103","Cross Duathlon","Jeune 6-9","Course à pied",250,275,225,5,"Min/km",5.0000000000000001E-3,1.25,1.5625,1.75,null,250,312.5,350,{"$f":"+R119/2","v":125},{"$f":"VLOOKUP(F119,AGE!F:J,4,FALSE)","v":2013},{"$f":"VLOOKUP(F119,AGE!F:J,5,FALSE)","v":2010}]
[40,10,4,"40104","Cross Duathlon","Jeune 6-9","Total",{"$f":"SUM(H117:H119)","v":1500},{"$f":"SUM(I117:I119)","v":1650},{"$f":"SUM(J117:J119)","v":1350},null,null,"",{"$f":"SUM(N117:N119)","v":6.5},{"$f":"SUM(O117:O119)","v":8.125},null,{"$f":"SUM(Q117:Q119)","v":0},{"$f":"SUM(R117:R119)","v":1500},{"$f":"SUM(S117:S119)","v":1875},null,{"$f":"SUM(U117:U119)","v":750},{"$f":"VLOOKUP(F120,AGE!F:J,4,FALSE)","v":2013},{"$f":"VLOOKUP(F120,AGE!F:J,5,FALSE)","v":2010}]
[40,20,1,"40201","Cross Duathlon","Jeune 8-11","Course à pied",500,{"$f":"H121*1.1","v":550},{"$f":"H121*0.9","v":450},5,"Min/km",5.0000000000000001E-3,{"$f":"H121*M121","v":2.5},{"$f":"N121*1.25","v":3.125},{"$f":"N121*1.4","v":3.5},{"$f":"O117","v":1.5625},{"$f":"N121/M121","v":500},{"$f":"O121/M121","v":625},{"$f":"P121/M121","v":700},{"$f":"S117+1","v":313.5},{"$f":"VLOOKUP(F121,AGE!F:J,4,FALSE)","v":2011},{"$f":"VLOOKUP(F121,AGE!F:J,5,FALSE)","v":2008}]
[40,20,2,"40202","Cross Duathlon","Jeune 8-11","Vélo",2000,{"$f":"H122*1.1","v":2200},{"$f":"H122*0.9","v":1800},15,"Km/h",4.0000000000000001E-3,{"$f":"H122*M122","v":8},{"$f":"N122*1.25","v":10},{"$f":"N122*1.4","v":11.2},{"$f":"O118","v":5},{"$f":"N122/M122","v":2000},{"$f":"O122/M122","v":2500},{"$f":"P122/M122","v":2799.9999999999995},{"$f":"S118+1","v":1251},{"$f":"VLOOKUP(F122,AGE!F:J,4,FALSE)","v":2011},{"$f":"VLOOKUP(F122,AGE!F:J,5,FALSE)","v":2008}]
[40,20,3,"40203","Cross Duathlon","Jeune 8-11","Course à pied",500,550,450,5,"Min/km",5.0000000000000001E-3,2.5,3.125,3.5,1.5625,500,625,700,{"$f":"S119+1","v":313.5},{"$f":"VLOOKUP(F123,AGE!F:J,4,FALSE)","v":2011},{"$f":"VLOOKUP(F123,AGE!F:J,5,FALSE)","v":2008}]
[40,20,4,"40204","Cross Duathlon","Jeune 8-11","Total",{"$f":"SUM(H121:H123)","v":3000},{"$f":"SUM(I121:I123)","v":3300},{"$f":"SUM(J121:J123)","v":2700},null,null,"",{"$f":"SUM(N121:N123)","v":13},{"$f":"SUM(O121:O123)","v":16.25},null,{"$f":"SUM(Q121:Q123)","v":8.125},{"$f":"SUM(R121:R123)","v":3000},{"$f":"SUM(S121:S123)","v":3750},null,{"$f":"SUM(U121:U123)","v":1878},{"$f":"VLOOKUP(F124,AGE!F:J,4,FALSE)","v":2011},{"$f":"VLOOKUP(F124,AGE!F:J,5,FALSE)","v":2008}]
[40,30,1,"40301","Cross Duathlon","Jeune 10-13","Course à pied",750,{"$f":"H125*1.1","v":825.00000000000011},{"$f":"H125*0.9","v":675},5,"Min/km",5.0000000000000001E-3,{"$f":"H125*M125","v":3.75},{"$f":"N125*1.25","v":4.6875},{"$f":"N125*1.4","v":5.25},{"$f":"O121","v":3.125},{"$f":"N125/M125","v":750},{"$f":"O125/M125","v":937.5},{"$f":"P125/M125","v":1050},{"$f":"S121+1","v":626},{"$f":"VLOOKUP(F125,AGE!F:J,4,FALSE)","v":2009},{"$f":"VLOOKUP(F125,AGE!F:J,5,FALSE)","v":2006}]
[40,30,2,"40302","Cross Duathlon","Jeune 10-13","Cyclisme",5000,{"$f":"H126*1.1","v":5500},{"$f":"H126*0.9","v":4500},15,"Km/h",4.0000000000000001E-3,{"$f":"H126*M126","v":20},{"$f":"N126*1.25","v":25},{"$f":"N126*1.4","v":28},{"$f":"O122","v":10},{"$f":"N126/M126","v":5000},{"$f":"O126/M126","v":6250},{"$f":"P126/M126","v":7000},{"$f":"S122+1","v":2501},{"$f":"VLOOKUP(F126,AGE!F:J,4,FALSE)","v":2009},{"$f":"VLOOKUP(F126,AGE!F:J,5,FALSE)","v":2006}]
[40,30,3,"40303","Cross Duathlon","Jeune 10-13","Course à pied",750,825.00000000000011,675,5,"Min/km",5.0000000000000001E-3,3.75,4.6875,5.25,3.125,750,937.5,1050,{"$f":"S123+1","v":626},{"$f":"VLOOKUP(F127,AGE!F:J,4,FALSE)","v":2009},{"$f":"VLOOKUP(F127,AGE!F:J,5,FALSE)","v":2006}]
[40,30,4,"40304","Cross Duathlon","Jeune 10-13","Total",{"$f":"SUM(H125:H127)","v":6500},{"$f":"SUM(I125:I127)","v":7150},{"$f":"SUM(J125:J127)","v":5850},null,null,"",{"$f":"SUM(N125:N127)","v":27.5},{"$f":"SUM(O125:O127)","v":34.375},null,{"$f":"SUM(Q125:Q127)","v":16.25},{"$f":"SUM(R125:R127)","v":6500},{"$f":"SUM(S125:S127)","v":8125},null,{"$f":"SUM(U125:U127)","v":3753},{"$f":"VLOOKUP(F128,AGE!F:J,4,FALSE)","v":2009},{"$f":"VLOOKUP(F128,AGE!F:J,5,FALSE)","v":2006}]
[40,40,1,"40401","Cross Duathlon","Jeune 12-19","Course à pied",1000,{"$f":"H129*1.1","v":1100},{"$f":"H129*0.9","v":900},5,"Min/km",5.0000000000000001E-3,{"$f":"H129*M129","v":5},{"$f":"N129*1.25","v":6.25},{"$f":"N129*1.4","v":7},{"$f":"O125","v":4.6875},{"$f":"N129/M129","v":1000},{"$f":"O129/M129","v":1250},{"$f":"P129/M129","v":1400},{"$f":"S125+1","v":938.5},{"$f":"VLOOKUP(F129,AGE!F:J,4,FALSE)","v":2007},{"$f":"VLOOKUP(F129,AGE!F:J,5,FALSE)","v":2000}]
[40,40,2,"40402","Cross Duathlon","Jeune 12-19","Cyclisme",6000,{"$f":"H130*1.1","v":6600.0000000000009},{"$f":"H130*0.9","v":5400},15,"Km/h",4.0000000000000001E-3,{"$f":"H130*M130","v":24},{"$f":"N130*1.25","v":30},{"$f":"N130*1.4","v":33.599999999999994},{"$f":"O126","v":25},{"$f":"N130/M130","v":6000},{"$f":"O130/M130","v":7500},{"$f":"P130/M130","v":8399.9999999999982},{"$f":"S126+1","v":6251},{"$f":"VLOOKUP(F130,AGE!F:J,4,FALSE)","v":2007},{"$f":"VLOOKUP(F130,AGE!F:J,5,FALSE)","v":2000}]
[40,40,3,"40403","Cross Duathlon","Jeune 12-19","Course à pied",1000,1100,900,5,"Min/km",5.0000000000000001E-3,5,6.25,7,4.6875,1000,1250,1400,{"$f":"S127+1","v":938.5},{"$f":"VLOOKUP(F131,AGE!F:J,4,FALSE)","v":2007},{"$f":"VLOOKUP(F131,AGE!F:J,5,FALSE)","v":2000}]
[40,40,4,"40404","Cross Duathlon","Jeune 12-19","Total",{"$f":"SUM(H129:H131)","v":8000},{"$f":"SUM(I129:I131)","v":8800},{"$f":"SUM(J129:J131)","v":7200},null,null,"",{"$f":"SUM(N129:N131)","v":34},{"$f":"SUM(O129:O131)","v":42.5},null,{"$f":"SUM(Q129:Q131)","v":34.375},{"$f":"SUM(R129:R131)","v":8000},{"$f":"SUM(S129:S131)","v":10000},null,{"$f":"SUM(U129:U131)","v":8128},{"$f":"VLOOKUP(F132,AGE!F:J,4,FALSE)","v":2007},{"$f":"VLOOKUP(F132,AGE!F:J,5,FALSE)","v":2000}]
[40,50,1,"40501","Cross Duathlon","Distance XS","Course à pied",2000,{"$f":"H133*1.1","v":2200},{"$f":"H133*0.9","v":1800},4.5,"Min/km",4.4999999999999997E-3,{"$f":"H133*M133","v":9},{"$f":"N133*1.25","v":11.25},{"$f":"N133*1.4","v":12.6},{"$f":"O129","v":6.25},{"$f":"N133/M133","v":2000.0000000000002},{"$f":"O133/M133","v":2500},{"$f":"P133/M133","v":2800},{"$f":"S129+1","v":1251},{"$f":"VLOOKUP(F133,AGE!F:J,4,FALSE)","v":2007},{"$f":"VLOOKUP(F133,AGE!F:J,5,FALSE)","v":1920}]
[40,50,2,{"$f":"CONCATENATE(A134,B134,C134)","v":"40502"},"Cross Duathlon","Distance XS","Cyclisme",5500,{"$f":"H134*1.1","v":6050.0000000000009},{"$f":"H134*0.9","v":4950},15,"Km/h",4.0000000000000001E-3,{"$f":"H134*M134","v":22},{"$f":"N134*1.25","v":27.5},30.799999999999997,{"$f":"O130","v":30},{"$f":"N134/M134","v":5500},{"$f":"O134/M134","v":6875},{"$f":"P134/M134","v":7699.9999999999991},{"$f":"S130+1","v":7501},{"$f":"VLOOKUP(F134,AGE!F:J,4,FALSE)","v":2007},{"$f":"VLOOKUP(F134,AGE!F:J,5,FALSE)","v":1920}]
[40,50,3,"40503","Cross Duathlon","Distance XS","Course à pied",1000,1100,900,4.5,"Min/km",4.4999999999999997E-3,4.5,5.625,6.3,6.25,1000.0000000000001,1250,1400,{"$f":"S131+1","v":1251},{"$f":"VLOOKUP(F135,AGE!F:J,4,FALSE)","v":2007},{"$f":"VLOOKUP(F135,AGE!F:J,5,FALSE)","v":1920}]
[40,50,4,"40504","Cross Duathlon","Distance XS","Total",{"$f":"SUM(H133:H135)","v":8500},{"$f":"SUM(I133:I135)","v":9350},{"$f":"SUM(J133:J135)","v":7650},null,null,"",{"$f":"SUM(N133:N135)","v":35.5},{"$f":"SUM(O133:O135)","v":44.375},null,{"$f":"SUM(Q133:Q135)","v":42.5},{"$f":"SUM(R133:R135)","v":8500},{"$f":"SUM(S133:S135)","v":10625},null,{"$f":"SUM(U133:U135)","v":10003},{"$f":"VLOOKUP(F136,AGE!F:J,4,FALSE)","v":2007},{"$f":"VLOOKUP(F136,AGE!F:J,5,FALSE)","v":1920}]
[40,60,1,"40601","Cross Duathlon","Distance S","Course à pied",4000,{"$f":"H137*1.1","v":4400},{"$f":"H137*0.9","v":3600},4.5,"Min/km",4.4999999999999997E-3,{"$f":"H137*M137","v":18},{"$f":"N137*1.25","v":22.5},{"$f":"N137*1.4","v":25.2},{"$f":"O133","v":11.25},{"$f":"N137/M137","v":4000.0000000000005},{"$f":"O137/M137","v":5000},{"$f":"P137/M137","v":5600},{"$f":"S133+1","v":2501},{"$f":"VLOOKUP(F137,AGE!F:J,4,FALSE)","v":2003},{"$f":"VLOOKUP(F137,AGE!F:J,5,FALSE)","v":1920}]
[40,60,2,"40602","Cross Duathlon","Distance S","Cyclisme",11000,{"$f":"H138*1.1","v":12100.000000000002},{"$f":"H138*0.9","v":9900},15,"Km/h",4.0000000000000001E-3,{"$f":"H138*M138","v":44},{"$f":"N138*1.25","v":55},61.599999999999994,{"$f":"O134","v":27.5},{"$f":"N138/M138","v":11000},{"$f":"O138/M138","v":13750},{"$f":"P138/M138","v":15399.999999999998},{"$f":"S134+1","v":6876},{"$f":"VLOOKUP(F138,AGE!F:J,4,FALSE)","v":2003},{"$f":"VLOOKUP(F138,AGE!F:J,5,FALSE)","v":1920}]
[40,60,3,"40603","Cross Duathlon","Distance S","Course à pied",2000,2200,1800,4.5,"Min/km",4.4999999999999997E-3,9,11.25,12.6,5.625,2000.0000000000002,2500,2800,{"$f":"S135+1","v":1251},{"$f":"VLOOKUP(F139,AGE!F:J,4,FALSE)","v":2003},{"$f":"VLOOKUP(F139,AGE!F:J,5,FALSE)","v":1920}]
[40,60,4,"40604","Cross Duathlon","Distance S","Total",{"$f":"SUM(H137:H139)","v":17000},{"$f":"SUM(I137:I139)","v":18700},{"$f":"SUM(J137:J139)","v":15300},null,null,"",{"$f":"SUM(N137:N139)","v":71},{"$f":"SUM(O137:O139)","v":88.75},null,{"$f":"SUM(Q137:Q139)","v":44.375},{"$f":"SUM(R137:R139)","v":17000},{"$f":"SUM(S137:S139)","v":21250},null,{"$f":"SUM(U137:U139)","v":10628},{"$f":"VLOOKUP(F140,AGE!F:J,4,FALSE)","v":2003},{"$f":"VLOOKUP(F140,AGE!F:J,5,FALSE)","v":1920}]
[40,70,1,"40701","Cross Duathlon","Distance M","Course à pied",8000,{"$f":"H141*1.1","v":8800},{"$f":"H141*0.9","v":7200},4.5,"Min/km",4.4999999999999997E-3,{"$f":"H141*M141","v":36},{"$f":"N141*1.25","v":45},{"$f":"N141*1.4","v":50.4},{"$f":"O137","v":22.5},{"$f":"N141/M141","v":8000.0000000000009},{"$f":"O141/M141","v":10000},{"$f":"P141/M141","v":11200},{"$f":"S137+1","v":5001},{"$f":"VLOOKUP(F141,AGE!F:J,4,FALSE)","v":2001},{"$f":"VLOOKUP(F141,AGE!F:J,5,FALSE)","v":1920}]
[40,70,2,"40702","Cross Duathlon","Distance M","Vélo",22000,{"$f":"H142*1.1","v":24200.000000000004},{"$f":"H142*0.9","v":19800},15,"Km/h",4.0000000000000001E-3,{"$f":"H142*M142","v":88},{"$f":"N142*1.25","v":110},123.19999999999999,{"$f":"O138","v":55},{"$f":"N142/M142","v":22000},{"$f":"O142/M142","v":27500},{"$f":"P142/M142","v":30799.999999999996},{"$f":"S138+1","v":13751},{"$f":"VLOOKUP(F142,AGE!F:J,4,FALSE)","v":2001},{"$f":"VLOOKUP(F142,AGE!F:J,5,FALSE)","v":1920}]
[40,70,3,"40703","Cross Duathlon","Distance M","Course à pied",4000,4400,3600,4.5,"Min/km",4.4999999999999997E-3,18,22.5,25.2,{"$f":"O139","v":11.25},4000.0000000000005,5000,5600,{"$f":"S139+1","v":2501},{"$f":"VLOOKUP(F143,AGE!F:J,4,FALSE)","v":2001},{"$f":"VLOOKUP(F143,AGE!F:J,5,FALSE)","v":1920}]
[40,70,4,"40704","Cross Duathlon","Distance M","Total",{"$f":"SUM(H141:H143)","v":34000},{"$f":"SUM(I141:I143)","v":37400},{"$f":"SUM(J141:J143)","v":30600},null,null,"",{"$f":"SUM(N141:N143)","v":142},{"$f":"SUM(O141:O143)","v":177.5},null,{"$f":"SUM(Q141:Q142)","v":77.5},{"$f":"SUM(R141:R143)","v":34000},{"$f":"SUM(S141:S143)","v":42500},null,{"$f":"SUM(U141:U143)","v":21253},{"$f":"VLOOKUP(F144,AGE!F:J,4,FALSE)","v":2001},{"$f":"VLOOKUP(F144,AGE!F:J,5,FALSE)","v":1920}]
[40,80,1,"40801","Cross Duathlon","Distance L","Course à pied",16000,{"$f":"H145*1.1","v":17600},{"$f":"H145*0.9","v":14400},4.5,"Min/km",{"$f":"IF(L145=\"Sec/100m\",((K145)/60/100),(IF(L145=\"Km/h\",60/K145/1000,(IF(L145=\"Min/km\",K145/1000,\"\")))))","v":4.4999999999999997E-3},{"$f":"H145*M145","v":72},{"$f":"N145*1.25","v":90},null,{"$f":"O141","v":45},{"$f":"N145/M145","v":16000.000000000002},{"$f":"O145/M145","v":20000},{"$f":"P145/M145","v":0},{"$f":"S141+1","v":10001},{"$f":"VLOOKUP(F145,AGE!F:J,4,FALSE)","v":2001},{"$f":"VLOOKUP(F145,AGE!F:J,5,FALSE)","v":1920}]
[40,80,2,"40802","Cross Duathlon","Distance L","Cyclisme",44000,{"$f":"H146*1.1","v":48400.000000000007},{"$f":"H146*0.9","v":39600},15,"Km/h",4.0000000000000001E-3,{"$f":"H146*M146","v":176},{"$f":"N146*1.25","v":220},null,{"$f":"O142","v":110},{"$f":"N146/M146","v":44000},{"$f":"O146/M146","v":55000},{"$f":"P146/M146","v":0},{"$f":"S142+1","v":27501},{"$f":"VLOOKUP(F146,AGE!F:J,4,FALSE)","v":2001},{"$f":"VLOOKUP(F146,AGE!F:J,5,FALSE)","v":1920}]
[40,80,3,"40803","Cross Duathlon","Distance L","Course à pied",8000,8800,7200,4.5,"Min/km",4.4999999999999997E-3,36,45,null,{"$f":"O143","v":22.5},8000.0000000000009,10000,0,{"$f":"S143+1","v":5001},{"$f":"VLOOKUP(F147,AGE!F:J,4,FALSE)","v":2001},{"$f":"VLOOKUP(F147,AGE!F:J,5,FALSE)","v":1920}]
[40,80,4,"40804","Cross Duathlon","Distance L","Total",{"$f":"SUM(H145:H147)","v":68000},{"$f":"SUM(I145:I147)","v":74800},{"$f":"SUM(J145:J147)","v":61200},null,null,"",{"$f":"SUM(N145:N147)","v":284},{"$f":"SUM(O145:O147)","v":355},null,{"$f":"SUM(Q145:Q146)","v":155},{"$f":"SUM(R145:R147)","v":68000},{"$f":"SUM(S145:S147)","v":85000},null,{"$f":"SUM(U145:U147)","v":42503},{"$f":"VLOOKUP(F148,AGE!F:J,4,FALSE)","v":2001},{"$f":"VLOOKUP(F148,AGE!F:J,5,FALSE)","v":1920}]
[40,90,1,"40901","Cross Duathlon","Distance XL","Course à pied",24000,{"$f":"H149*1.1","v":26400.000000000004},{"$f":"H149*0.9","v":21600},4.5,"Min/km",4.4999999999999997E-3,{"$f":"H149*M149","v":107.99999999999999},{"$f":"N149*1.25","v":134.99999999999997},null,{"$f":"O145","v":90},{"$f":"N149/M149","v":24000},{"$f":"O149/M149","v":29999.999999999996},{"$f":"P149/M149","v":0},{"$f":"S145+1","v":20001},{"$f":"VLOOKUP(F149,AGE!F:J,4,FALSE)","v":2001},{"$f":"VLOOKUP(F149,AGE!F:J,5,FALSE)","v":1920}]
[40,90,2,"40902","Cross Duathlon","Distance XL","Cyclisme",66000,{"$f":"H150*1.1","v":72600},{"$f":"H150*0.9","v":59400},15,"Km/h",4.0000000000000001E-3,{"$f":"H150*M150","v":264},{"$f":"N150*1.25","v":330},null,{"$f":"O146","v":220},{"$f":"N150/M150","v":66000},{"$f":"O150/M150","v":82500},{"$f":"P150/M150","v":0},{"$f":"S146+1","v":55001},{"$f":"VLOOKUP(F150,AGE!F:J,4,FALSE)","v":2001},{"$f":"VLOOKUP(F150,AGE!F:J,5,FALSE)","v":1920}]
[40,90,3,"40903","Cross Duathlon","Distance XL","Course à pied",12000,13200.000000000002,10800,4.5,"Min/km",4.4999999999999997E-3,{"$f":"H151*M151","v":53.999999999999993},67.499999999999986,null,{"$f":"O147","v":45},12000,14999.999999999998,0,{"$f":"S147+1","v":10001},{"$f":"VLOOKUP(F151,AGE!F:J,4,FALSE)","v":2001},{"$f":"VLOOKUP(F151,AGE!F:J,5,FALSE)","v":1920}]
[40,90,4,"40904","Cross Duathlon","Distance XL","Total",{"$f":"SUM(H149:H151)","v":102000},{"$f":"SUM(I149:I151)","v":112200},{"$f":"SUM(J149:J151)","v":91800},null,null,"",{"$f":"SUM(N149:N151)","v":426},{"$f":"SUM(O149:O151)","v":532.5},null,{"$f":"SUM(Q149:Q150)","v":310},{"$f":"SUM(R149:R151)","v":102000},{"$f":"SUM(S149:S151)","v":127500},null,{"$f":"SUM(U149:U151)","v":85003},{"$f":"VLOOKUP(F152,AGE!F:J,4,FALSE)","v":2001},{"$f":"VLOOKUP(F152,AGE!F:J,5,FALSE)","v":1920}]
[50,10,1,"50101","Aquathlon","Jeune 6-9","Natation",50,{"$f":"H153*1.1","v":55.000000000000007},{"$f":"H153*0.9","v":45},{"$f":"60+50","v":110},"Sec/100m",1.8333333333333333E-2,{"$f":"H153*M153","v":0.91666666666666663},{"$f":"N153*1.25","v":1.1458333333333333},{"$f":"N153*1.4","v":1.2833333333333332},null,{"$f":"N153/M153","v":50},{"$f":"O153/M153","v":62.499999999999993},{"$f":"P153/M153","v":70},{"$f":"+R153/2","v":25},{"$f":"VLOOKUP(F153,AGE!F:J,4,FALSE)","v":2013},{"$f":"VLOOKUP(F153,AGE!F:J,5,FALSE)","v":2010}]
[50,10,2,"50102","Aquathlon","Jeune 6-9","Course à pied",500,{"$f":"H154*1.1","v":550},{"$f":"H154*0.9","v":450},5,"Min/km",5.0000000000000001E-3,{"$f":"H154*M154","v":2.5},{"$f":"N154*1.25","v":3.125},{"$f":"N154*1.4","v":3.5},null,{"$f":"N154/M154","v":500},{"$f":"O154/M154","v":625},{"$f":"P154/M154","v":700},{"$f":"+R154/2","v":250},{"$f":"VLOOKUP(F154,AGE!F:J,4,FALSE)","v":2013},{"$f":"VLOOKUP(F154,AGE!F:J,5,FALSE)","v":2010}]
[50,10,3,"50103","Aquathlon","Jeune 6-9",null,null,null,null,null,null,null,null,null,null,null,null,null,null,null,{"$f":"VLOOKUP(F155,AGE!F:J,4,FALSE)","v":2013},{"$f":"VLOOKUP(F155,AGE!F:J,5,FALSE)","v":2010}]
[50,10,4,"50104","Aquathlon","Jeune 6-9","Total",{"$f":"SUM(H153:H154)","v":550},{"$f":"SUM(I153:I154)","v":605},495,{"$f":"SUM(K153:K154)","v":115},null,"",{"$f":"SUM(N153:N154)","v":3.4166666666666665},{"$f":"SUM(O153:O154)","v":4.270833333333333},{"$f":"SUM(P153:P154)","v":4.7833333333333332},0,{"$f":"SUM(R153:R155)","v":550},{"$f":"SUM(S153:S155)","v":687.5},null,{"$f":"SUM(U153:U155)","v":275},{"$f":"VLOOKUP(F156,AGE!F:J,4,FALSE)","v":2013},{"$f":"VLOOKUP(F156,AGE!F:J,5,FALSE)","v":2010}]
[50,20,1,"50201","Aquathlon","Jeune 8-11","Natation",100,{"$f":"H157*1.1","v":110.00000000000001},{"$f":"H157*0.9","v":90},{"$f":"60+50","v":110},"Sec/100m",{"$f":"IF(L157=\"Sec/100m\",((K157)/60/100),(IF(L157=\"Km/h\",60/K157/1000,(IF(L157=\"Min/km\",K157/1000,\"\")))))","v":1.8333333333333333E-2},{"$f":"H157*M157","v":1.8333333333333333},{"$f":"N157*1.25","v":2.2916666666666665},{"$f":"N157*1.4","v":2.5666666666666664},{"$f":"O153","v":1.1458333333333333},{"$f":"N157/M157","v":100},{"$f":"O157/M157","v":124.99999999999999},{"$f":"P157/M157","v":140},{"$f":"S153+1","v":63.499999999999993},{"$f":"VLOOKUP(F157,AGE!F:J,4,FALSE)","v":2011},{"$f":"VLOOKUP(F157,AGE!F:J,5,FALSE)","v":2008}]
[50,20,2,"50202","Aquathlon","Jeune 8-11","Course à pied",1000,{"$f":"H158*1.1","v":1100},{"$f":"H158*0.9","v":900},5,"Min/km",5.0000000000000001E-3,{"$f":"H158*M158","v":5},{"$f":"N158*1.25","v":6.25},{"$f":"N158*1.4","v":7},{"$f":"O154","v":3.125},{"$f":"N158/M158","v":1000},{"$f":"O158/M158","v":1250},{"$f":"P158/M158","v":1400},{"$f":"S154+1","v":626},{"$f":"VLOOKUP(F158,AGE!F:J,4,FALSE)","v":2011},{"$f":"VLOOKUP(F158,AGE!F:J,5,FALSE)","v":2008}]
[50,20,3,{"$f":"CONCATENATE(A159,B159,C159)","v":"50203"},"Aquathlon","Jeune 8-11",null,null,null,null,null,null,null,null,null,null,null,null,null,null,null,{"$f":"VLOOKUP(F159,AGE!F:J,4,FALSE)","v":2011},{"$f":"VLOOKUP(F159,AGE!F:J,5,FALSE)","v":2008}]
[50,20,4,"50204","Aquathlon","Jeune 8-11","Total",{"$f":"SUM(H157:H158)","v":1100},{"$f":"SUM(I157:I158)","v":1210},{"$f":"SUM(J157:J158)","v":990},{"$f":"SUM(K157:K158)","v":115},null,"",{"$f":"SUM(N157:N158)","v":6.833333333333333},{"$f":"SUM(O157:O158)","v":8.5416666666666661},{"$f":"SUM(P157:P158)","v":9.5666666666666664},4.270833333333333,{"$f":"SUM(R157:R159)","v":1100},{"$f":"SUM(S157:S159)","v":1375},null,{"$f":"SUM(U157:U159)","v":689.5},{"$f":"VLOOKUP(F160,AGE!F:J,4,FALSE)","v":2011},{"$f":"VLOOKUP(F160,AGE!F:J,5,FALSE)","v":2008}]
[50,30,1,"50301","Aquathlon","Jeune 10-13","Natation",200,{"$f":"H161*1.1","v":220.00000000000003},{"$f":"H161*0.9","v":180},{"$f":"60+50","v":110},"Sec/100m",1.8333333333333333E-2,{"$f":"H161*M161","v":3.6666666666666665},{"$f":"N161*1.25","v":4.583333333333333},{"$f":"N161*1.4","v":5.1333333333333329},{"$f":"O157","v":2.2916666666666665},{"$f":"N161/M161","v":200},{"$f":"O161/M161","v":249.99999999999997},{"$f":"P161/M161","v":280},{"$f":"S157+1","v":125.99999999999999},{"$f":"VLOOKUP(F161,AGE!F:J,4,FALSE)","v":2009},{"$f":"VLOOKUP(F161,AGE!F:J,5,FALSE)","v":2006}]
[50,30,2,"50302","Aquathlon","Jeune 10-13","Course à pied",1500,{"$f":"H162*1.1","v":1650.0000000000002},{"$f":"H162*0.9","v":1350},5,"Min/km",5.0000000000000001E-3,{"$f":"H162*M162","v":7.5},{"$f":"N162*1.25","v":9.375},{"$f":"N162*1.4","v":10.5},{"$f":"O158","v":6.25},{"$f":"N162/M162","v":1500},{"$f":"O162/M162","v":1875},{"$f":"P162/M162","v":2100},{"$f":"S158+1","v":1251},{"$f":"VLOOKUP(F162,AGE!F:J,4,FALSE)","v":2009},{"$f":"VLOOKUP(F162,AGE!F:J,5,FALSE)","v":2006}]
[50,30,3,{"$f":"CONCATENATE(A163,B163,C163)","v":"50303"},"Aquathlon","Jeune 10-13",null,null,null,null,null,null,null,null,null,null,null,null,null,null,null,{"$f":"VLOOKUP(F163,AGE!F:J,4,FALSE)","v":2009},{"$f":"VLOOKUP(F163,AGE!F:J,5,FALSE)","v":2006}]
[50,30,4,"50304","Aquathlon","Jeune 10-13","Total",{"$f":"SUM(H161:H162)","v":1700},{"$f":"SUM(I161:I162)","v":1870.0000000000002},{"$f":"SUM(J161:J162)","v":1530},{"$f":"SUM(K161:K162)","v":115},null,"",{"$f":"SUM(N161:N162)","v":11.166666666666666},{"$f":"SUM(O161:O162)","v":13.958333333333332},{"$f":"SUM(P161:P162)","v":15.633333333333333},8.5416666666666661,{"$f":"SUM(R161:R163)","v":1700},{"$f":"SUM(S161:S163)","v":2125},null,{"$f":"SUM(U161:U163)","v":1377},{"$f":"VLOOKUP(F164,AGE!F:J,4,FALSE)","v":2009},{"$f":"VLOOKUP(F164,AGE!F:J,5,FALSE)","v":2006}]
[50,40,1,"50401","Aquathlon","Jeune 12-19","Natation",300,{"$f":"H165*1.1","v":330},{"$f":"H165*0.9","v":270},{"$f":"60+50","v":110},"Sec/100m",1.8333333333333333E-2,{"$f":"H165*M165","v":5.5},{"$f":"N165*1.25","v":6.875},{"$f":"N165*1.4","v":7.6999999999999993},{"$f":"O161","v":4.583333333333333},{"$f":"N165/M165","v":300},{"$f":"O165/M165","v":375},{"$f":"P165/M165","v":419.99999999999994},{"$f":"S161+1","v":250.99999999999997},{"$f":"VLOOKUP(F165,AGE!F:J,4,FALSE)","v":2007},{"$f":"VLOOKUP(F165,AGE!F:J,5,FALSE)","v":2000}]
[50,40,2,"50402","Aquathlon","Jeune 12-19","Course à pied",2000,{"$f":"H166*1.1","v":2200},{"$f":"H166*0.9","v":1800},5,"Min/km",5.0000000000000001E-3,{"$f":"H166*M166","v":10},{"$f":"N166*1.25","v":12.5},{"$f":"N166*1.4","v":14},{"$f":"O162","v":9.375},{"$f":"N166/M166","v":2000},{"$f":"O166/M166","v":2500},{"$f":"P166/M166","v":2800},{"$f":"S162+1","v":1876},{"$f":"VLOOKUP(F166,AGE!F:J,4,FALSE)","v":2007},{"$f":"VLOOKUP(F166,AGE!F:J,5,FALSE)","v":2000}]
[50,40,3,"50403","Aquathlon","Jeune 12-19",null,null,null,null,null,null,null,null,null,null,null,null,null,null,null,{"$f":"VLOOKUP(F167,AGE!F:J,4,FALSE)","v":2007},{"$f":"VLOOKUP(F167,AGE!F:J,5,FALSE)","v":2000}]
[50,40,4,"50404","Aquathlon","Jeune 12-19","Total",{"$f":"SUM(H165:H166)","v":2300},{"$f":"SUM(I165:I166)","v":2530},{"$f":"SUM(J165:J166)","v":2070},{"$f":"SUM(K165:K166)","v":115},null,"",{"$f":"SUM(N165:N166)","v":15.5},{"$f":"SUM(O165:O166)","v":19.375},{"$f":"SUM(P165:P166)","v":21.7},13.958333333333332,{"$f":"SUM(R165:R167)","v":2300},{"$f":"SUM(S165:S167)","v":2875},null,{"$f":"SUM(U165:U167)","v":2127},{"$f":"VLOOKUP(F168,AGE!F:J,4,FALSE)","v":2007},{"$f":"VLOOKUP(F168,AGE!F:J,5,FALSE)","v":2000}]
[50,50,1,"50501","Aquathlon","Distance XS","Natation",500,{"$f":"H169*1.1","v":550},{"$f":"H169*0.9","v":450},105,"Sec/100m",1.7500000000000002E-2,{"$f":"H169*M169","v":8.75},{"$f":"N169*1.25","v":10.9375},{"$f":"N169*1.4","v":12.25},{"$f":"O165","v":6.875},{"$f":"N169/M169","v":499.99999999999994},{"$f":"O169/M169","v":624.99999999999989},{"$f":"P169/M169","v":699.99999999999989},{"$f":"S165+1","v":376},{"$f":"VLOOKUP(F169,AGE!F:J,4,FALSE)","v":2007},{"$f":"VLOOKUP(F169,AGE!F:J,5,FALSE)","v":1920}]
[50,50,2,"50502","Aquathlon","Distance XS","Course à pied",2500,{"$f":"H170*1.1","v":2750},{"$f":"H170*0.9","v":2250},4.5,"Min/km",4.4999999999999997E-3,{"$f":"H170*M170","v":11.25},{"$f":"N170*1.25","v":14.0625},{"$f":"N170*1.4","v":15.749999999999998},{"$f":"O166","v":12.5},{"$f":"N170/M170","v":2500},{"$f":"O170/M170","v":3125.0000000000005},{"$f":"P170/M170","v":3500},{"$f":"S166+1","v":2501},{"$f":"VLOOKUP(F170,AGE!F:J,4,FALSE)","v":2007},{"$f":"VLOOKUP(F170,AGE!F:J,5,FALSE)","v":1920}]
[50,50,3,"50503","Aquathlon","Distance XS",null,null,null,null,null,null,null,null,null,null,null,null,null,null,null,{"$f":"VLOOKUP(F171,AGE!F:J,4,FALSE)","v":2007},{"$f":"VLOOKUP(F171,AGE!F:J,5,FALSE)","v":1920}]
[50,50,4,"50504","Aquathlon","Distance XS","Total",{"$f":"SUM(H169:H170)","v":3000},{"$f":"SUM(I169:I170)","v":3300},{"$f":"SUM(J169:J170)","v":2700},{"$f":"SUM(K169:K170)","v":109.5},null,"",{"$f":"SUM(N169:N170)","v":20},{"$f":"SUM(O169:O170)","v":25},null,{"$f":"SUM(Q169:Q170)","v":19.375},{"$f":"SUM(R169:R171)","v":3000},{"$f":"SUM(S169:S171)","v":3750.0000000000005},null,{"$f":"SUM(U169:U171)","v":2877},{"$f":"VLOOKUP(F172,AGE!F:J,4,FALSE)","v":2007},{"$f":"VLOOKUP(F172,AGE!F:J,5,FALSE)","v":1920}]
[50,60,1,"50601","Aquathlon","Distance S","Natation",1000,{"$f":"H173*1.1","v":1100},{"$f":"H173*0.9","v":900},105,"Sec/100m",{"$f":"IF(L173=\"Sec/100m\",((K173)/60/100),(IF(L173=\"Km/h\",60/K173/1000,(IF(L173=\"Min/km\",K173/1000,\"\")))))","v":1.7500000000000002E-2},{"$f":"H173*M173","v":17.5},{"$f":"N173*1.25","v":21.875},{"$f":"N173*1.4","v":24.5},{"$f":"O169","v":10.9375},{"$f":"N173/M173","v":999.99999999999989},{"$f":"O173/M173","v":1249.9999999999998},{"$f":"P173/M173","v":1399.9999999999998},{"$f":"S169+1","v":625.99999999999989},{"$f":"VLOOKUP(F173,AGE!F:J,4,FALSE)","v":2003},{"$f":"VLOOKUP(F173,AGE!F:J,5,FALSE)","v":1920}]
[50,60,2,"50602","Aquathlon","Distance S","Course à pied",5000,{"$f":"H174*1.1","v":5500},{"$f":"H174*0.9","v":4500},4.5,"Min/km",4.4999999999999997E-3,{"$f":"H174*M174","v":22.5},{"$f":"N174*1.25","v":28.125},{"$f":"N174*1.4","v":31.499999999999996},{"$f":"O170","v":14.0625},{"$f":"N174/M174","v":5000},{"$f":"O174/M174","v":6250.0000000000009},{"$f":"P174/M174","v":7000},{"$f":"S170+1","v":3126.0000000000005},{"$f":"VLOOKUP(F174,AGE!F:J,4,FALSE)","v":2003},{"$f":"VLOOKUP(F174,AGE!F:J,5,FALSE)","v":1920}]
[50,60,3,"50603","Aquathlon","Distance S",null,null,null,null,null,null,null,null,null,null,null,null,null,null,null,{"$f":"VLOOKUP(F175,AGE!F:J,4,FALSE)","v":2003},{"$f":"VLOOKUP(F175,AGE!F:J,5,FALSE)","v":1920}]
[50,60,4,"50604","Aquathlon","Distance S","Total",{"$f":"SUM(H173:H174)","v":6000},{"$f":"SUM(I173:I174)","v":6600},{"$f":"SUM(J173:J174)","v":5400},{"$f":"SUM(K173:K174)","v":109.5},null,"",{"$f":"SUM(N173:N174)","v":40},{"$f":"SUM(O173:O174)","v":50},null,{"$f":"SUM(Q173:Q174)","v":25},{"$f":"SUM(R173:R175)","v":6000},{"$f":"SUM(S173:S175)","v":7500.0000000000009},null,{"$f":"SUM(U173:U175)","v":3752.0000000000005},{"$f":"VLOOKUP(F176,AGE!F:J,4,FALSE)","v":2003},{"$f":"VLOOKUP(F176,AGE!F:J,5,FALSE)","v":1920}]
[50,70,1,"50701","Aquathlon","Distance M","Natation",2000,{"$f":"H177*1.1","v":2200},{"$f":"H177*0.9","v":1800},105,"Sec/100m",1.7500000000000002E-2,{"$f":"H177*M177","v":35},{"$f":"N177*1.25","v":43.75},{"$f":"N177*1.4","v":49},{"$f":"O173","v":21.875},{"$f":"N177/M177","v":1999.9999999999998},{"$f":"O177/M177","v":2499.9999999999995},{"$f":"P177/M177","v":2799.9999999999995},{"$f":"S173+1","v":1250.9999999999998},{"$f":"VLOOKUP(F177,AGE!F:J,4,FALSE)","v":2001},{"$f":"VLOOKUP(F177,AGE!F:J,5,FALSE)","v":1920}]
[50,70,2,"50702","Aquathlon","Distance M","Course à pied",10000,{"$f":"H178*1.1","v":11000},{"$f":"H178*0.9","v":9000},4.5,"Min/km",4.4999999999999997E-3,{"$f":"H178*M178","v":45},{"$f":"N178*1.25","v":56.25},{"$f":"N178*1.4","v":62.999999999999993},{"$f":"O174","v":28.125},{"$f":"N178/M178","v":10000},{"$f":"O178/M178","v":12500.000000000002},{"$f":"P178/M178","v":14000},{"$f":"S174+1","v":6251.0000000000009},{"$f":"VLOOKUP(F178,AGE!F:J,4,FALSE)","v":2001},{"$f":"VLOOKUP(F178,AGE!F:J,5,FALSE)","v":1920}]
[50,70,3,"50703","Aquathlon","Distance M",null,null,null,null,null,null,null,null,null,null,null,null,null,null,null,{"$f":"VLOOKUP(F179,AGE!F:J,4,FALSE)","v":2001},{"$f":"VLOOKUP(F179,AGE!F:J,5,FALSE)","v":1920}]
[50,70,4,"50704","Aquathlon","Distance M","Total",{"$f":"SUM(H177:H178)","v":12000},{"$f":"SUM(I177:I178)","v":13200},{"$f":"SUM(J177:J178)","v":10800},{"$f":"SUM(K177:K178)","v":109.5},null,"",{"$f":"SUM(N177:N178)","v":80},{"$f":"SUM(O177:O178)","v":100},null,{"$f":"SUM(Q177:Q178)","v":50},{"$f":"SUM(R177:R179)","v":12000},{"$f":"SUM(S177:S179)","v":15000.000000000002},null,{"$f":"SUM(U177:U179)","v":7502.0000000000009},{"$f":"VLOOKUP(F180,AGE!F:J,4,FALSE)","v":2001},{"$f":"VLOOKUP(F180,AGE!F:J,5,FALSE)","v":1920}]
[50,80,1,"50801","Aquathlon","Distance L","Natation",3000,{"$f":"H181*1.1","v":3300.0000000000005},{"$f":"H181*0.9","v":2700},105,"Sec/100m",1.7500000000000002E-2,{"$f":"H181*M181","v":52.500000000000007},{"$f":"N181*1.25","v":65.625000000000014},null,{"$f":"O177","v":43.75},{"$f":"N181/M181","v":3000},{"$f":"O181/M181","v":3750.0000000000005},{"$f":"P181/M181","v":0},{"$f":"S177+1","v":2500.9999999999995},{"$f":"VLOOKUP(F181,AGE!F:J,4,FALSE)","v":2001},{"$f":"VLOOKUP(F181,AGE!F:J,5,FALSE)","v":1920}]
[50,80,2,"50802","Aquathlon","Distance L","Course à pied",15000,{"$f":"H182*1.1","v":16500},{"$f":"H182*0.9","v":13500},4.5,"Min/km",4.4999999999999997E-3,{"$f":"H182*M182","v":67.5},{"$f":"N182*1.25","v":84.375},null,{"$f":"O178","v":56.25},{"$f":"N182/M182","v":15000.000000000002},{"$f":"O182/M182","v":18750},{"$f":"P182/M182","v":0},{"$f":"S178+1","v":12501.000000000002},{"$f":"VLOOKUP(F182,AGE!F:J,4,FALSE)","v":2001},{"$f":"VLOOKUP(F182,AGE!F:J,5,FALSE)","v":1920}]
[50,80,3,{"$f":"CONCATENATE(A183,B183,C183)","v":"50803"},"Aquathlon","Distance L",null,null,null,null,null,null,null,null,null,null,null,null,null,null,null,{"$f":"VLOOKUP(F183,AGE!F:J,4,FALSE)","v":2001},{"$f":"VLOOKUP(F183,AGE!F:J,5,FALSE)","v":1920}]
[50,80,4,"50804","Aquathlon","Distance L","Total",{"$f":"SUM(H181:H182)","v":18000},{"$f":"SUM(I181:I182)","v":19800},{"$f":"SUM(J181:J182)","v":16200},{"$f":"SUM(K181:K182)","v":109.5},null,"",{"$f":"SUM(N181:N182)","v":120},{"$f":"SUM(O181:O182)","v":150},null,{"$f":"SUM(Q181:Q182)","v":100},{"$f":"SUM(R181:R183)","v":18000},{"$f":"SUM(S181:S183)","v":22500},null,{"$f":"SUM(U181:U183)","v":15002.000000000002},{"$f":"VLOOKUP(F184,AGE!F:J,4,FALSE)","v":2001},{"$f":"VLOOKUP(F184,AGE!F:J,5,FALSE)","v":1920}]
[50,90,1,"50901","Aquathlon","Distance XL","Natation",4000,{"$f":"H185*1.1","v":4400},{"$f":"H185*0.9","v":3600},105,"Sec/100m",1.7500000000000002E-2,{"$f":"H185*M185","v":70},{"$f":"N185*1.25","v":87.5},null,{"$f":"O181","v":65.625000000000014},{"$f":"N185/M185","v":3999.9999999999995},{"$f":"O185/M185","v":4999.9999999999991},{"$f":"P185/M185","v":0},{"$f":"S181+1","v":3751.0000000000005},{"$f":"VLOOKUP(F185,AGE!F:J,4,FALSE)","v":2001},{"$f":"VLOOKUP(F185,AGE!F:J,5,FALSE)","v":1920}]
[50,90,2,"50902","Aquathlon","Distance XL","Course à pied",20000,{"$f":"H186*1.1","v":22000},{"$f":"H186*0.9","v":18000},4.5,"Min/km",4.4999999999999997E-3,{"$f":"H186*M186","v":90},{"$f":"N186*1.25","v":112.5},null,{"$f":"O182","v":84.375},{"$f":"N186/M186","v":20000},{"$f":"O186/M186","v":25000.000000000004},{"$f":"P186/M186","v":0},{"$f":"S182+1","v":18751},{"$f":"VLOOKUP(F186,AGE!F:J,4,FALSE)","v":2001},{"$f":"VLOOKUP(F186,AGE!F:J,5,FALSE)","v":1920}]
[50,90,3,"50903","Aquathlon","Distance XL",null,null,null,null,null,null,null,null,null,null,null,null,null,null,null,{"$f":"VLOOKUP(F187,AGE!F:J,4,FALSE)","v":2001},{"$f":"VLOOKUP(F187,AGE!F:J,5,FALSE)","v":1920}]
[50,90,4,"50904","Aquathlon","Distance XL","Total",{"$f":"SUM(H185:H186)","v":24000},{"$f":"SUM(I185:I186)","v":26400},{"$f":"SUM(J185:J186)","v":21600},null,null,"",{"$f":"SUM(N185:N186)","v":160},{"$f":"SUM(O185:O186)","v":200},null,{"$f":"SUM(Q185:Q186)","v":150},{"$f":"SUM(R185:R187)","v":24000},{"$f":"SUM(S185:S187)","v":30000.000000000004},null,{"$f":"SUM(U185:U187)","v":22502},{"$f":"VLOOKUP(F188,AGE!F:J,4,FALSE)","v":2001},{"$f":"VLOOKUP(F188,AGE!F:J,5,FALSE)","v":1920}]
[60,10,1,"60101","Bike and Run","Jeune 6-9","Bike and Run",null,null,null,null,null,null,{"$f":"(O189+Q189)/2","v":9},12,null,6,null,null,null,null,{"$f":"VLOOKUP(F189,AGE!F:J,4,FALSE)","v":2013},{"$f":"VLOOKUP(F189,AGE!F:J,5,FALSE)","v":2010}]
[60,20,1,"60201","Bike and Run","Jeune 8-11","Bike and Run",null,null,null,null,null,null,15,18,null,12,null,null,null,null,{"$f":"VLOOKUP(F190,AGE!F:J,4,FALSE)","v":2011},{"$f":"VLOOKUP(F190,AGE!F:J,5,FALSE)","v":2008}]
[60,30,1,"60301","Bike and Run","Jeune 10-13","Bike and Run",null,null,null,null,null,null,21,24,null,{"$f":"+O190","v":18},null,null,null,null,{"$f":"VLOOKUP(F191,AGE!F:J,4,FALSE)","v":2009},{"$f":"VLOOKUP(F191,AGE!F:J,5,FALSE)","v":2006}]
[60,40,1,"60401","Bike and Run","Jeune 12-19","Bike and Run",null,null,null,null,null,null,27,30,null,{"$f":"+O191","v":24},null,null,null,null,{"$f":"VLOOKUP(F192,AGE!F:J,4,FALSE)","v":2007},{"$f":"VLOOKUP(F192,AGE!F:J,5,FALSE)","v":2000}]
[60,50,1,"60501","Bike and Run","Distance XS","Bike and Run",null,null,null,null,null,null,37.5,45,null,{"$f":"+O192","v":30},null,null,null,null,{"$f":"VLOOKUP(F193,AGE!F:J,4,FALSE)","v":2007},{"$f":"VLOOKUP(F193,AGE!F:J,5,FALSE)","v":1920}]
[60,60,1,"60601","Bike and Run","Distance S","Bike and Run",null,null,null,null,null,null,60,75,null,{"$f":"+O193","v":45},null,null,null,null,{"$f":"VLOOKUP(F194,AGE!F:J,4,FALSE)","v":2003},{"$f":"VLOOKUP(F194,AGE!F:J,5,FALSE)","v":1920}]
[60,70,1,"60701","Bike and Run","Distance M","Bike and Run",null,null,null,null,null,null,97.5,120,null,75,null,null,null,null,{"$f":"VLOOKUP(F195,AGE!F:J,4,FALSE)","v":2001},{"$f":"VLOOKUP(F195,AGE!F:J,5,FALSE)","v":1920}]
[60,80,1,"60801","Bike and Run","Distance L","Bike and Run",null,null,null,null,null,null,160,200,null,{"$f":"+O195","v":120},null,null,null,null,{"$f":"VLOOKUP(F196,AGE!F:J,4,FALSE)","v":2001},{"$f":"VLOOKUP(F196,AGE!F:J,5,FALSE)","v":1920}]
[70,50,1,"70501","Triathon des neiges","Distance XS","Course à pied",2000,{"$f":"H197*1.1","v":2200},{"$f":"H197*0.9","v":1800},4.5,"Min/km",{"$f":"IF(L197=\"Sec/100m\",((K197)/60/100),(IF(L197=\"Km/h\",60/K197/1000,(IF(L197=\"Min/km\",K197/1000,\"\")))))","v":4.4999999999999997E-3},{"$f":"H197*M197","v":9},{"$f":"N197*1.25","v":11.25},{"$f":"N197*1.4","v":12.6},{"$f":"O193","v":45},{"$f":"N197/M197","v":2000.0000000000002},{"$f":"O197/M197","v":2500},{"$f":"P197/M197","v":2800},{"$f":"+R197/2","v":1000.0000000000001},{"$f":"VLOOKUP(F197,AGE!F:J,4,FALSE)","v":2007},{"$f":"VLOOKUP(F197,AGE!F:J,5,FALSE)","v":1920}]
[70,50,2,"70502","Triathon des neiges","Distance XS","Cyclisme",3500,3850.0000000000005,3150,15,"Km/h",4.0000000000000001E-3,14,17.5,19.599999999999998,{"$f":"O194","v":75},3500,4375,4899.9999999999991,{"$f":"+R198/2","v":1750},{"$f":"VLOOKUP(F198,AGE!F:J,4,FALSE)","v":2007},{"$f":"VLOOKUP(F198,AGE!F:J,5,FALSE)","v":1920}]
[70,50,3,"70503","Triathon des neiges","Distance XS","Ski de Fond",3000,3300.0000000000005,2700,4.5,"Min/km",4.4999999999999997E-3,13.499999999999998,16.874999999999996,18.899999999999995,{"$f":"O195","v":120},3000,3749.9999999999995,4199.9999999999991,{"$f":"+R199/2","v":1500},{"$f":"VLOOKUP(F199,AGE!F:J,4,FALSE)","v":2007},{"$f":"VLOOKUP(F199,AGE!F:J,5,FALSE)","v":1920}]
[70,50,4,{"$f":"CONCATENATE(A200,B200,C200)","v":"70504"},"Triathon des neiges","Distance XS","Total",{"$f":"+SUM(H197:H199)","v":8500},{"$f":"SUM(I197:I198)","v":6050},4950,null,null,"",{"$f":"SUM(N197:N198)","v":23},{"$f":"SUM(O197:O198)","v":28.75},null,{"$f":"SUM(Q197:Q198)","v":120},{"$f":"SUM(R197:R199)","v":8500},{"$f":"SUM(S197:S199)","v":10625},null,{"$f":"SUM(U197:U199)","v":4250},{"$f":"VLOOKUP(F200,AGE!F:J,4,FALSE)","v":2007},{"$f":"VLOOKUP(F200,AGE!F:J,5,FALSE)","v":1920}]
[70,60,1,"70601","Triathon des neiges","Distance S","Course à pied",4000,{"$f":"H201*1.1","v":4400},{"$f":"H201*0.9","v":3600},4.5,"Min/km",{"$f":"IF(L201=\"Sec/100m\",((K201)/60/100),(IF(L201=\"Km/h\",60/K201/1000,(IF(L201=\"Min/km\",K201/1000,\"\")))))","v":4.4999999999999997E-3},{"$f":"H201*M201","v":18},{"$f":"N201*1.25","v":22.5},{"$f":"N201*1.4","v":25.2},{"$f":"O197","v":11.25},{"$f":"N201/M201","v":4000.0000000000005},{"$f":"O201/M201","v":5000},{"$f":"P201/M201","v":5600},{"$f":"S197+1","v":2501},{"$f":"VLOOKUP(F201,AGE!F:J,4,FALSE)","v":2003},{"$f":"VLOOKUP(F201,AGE!F:J,5,FALSE)","v":1920}]
[70,60,2,"70602","Triathon des neiges","Distance S","Cyclisme",7000,7700.0000000000009,6300,15,"Km/h",4.0000000000000001E-3,28,35,39.199999999999996,{"$f":"O198","v":17.5},7000,8750,9799.9999999999982,{"$f":"S198+1","v":4376},{"$f":"VLOOKUP(F202,AGE!F:J,4,FALSE)","v":2003},{"$f":"VLOOKUP(F202,AGE!F:J,5,FALSE)","v":1920}]
[70,60,3,"70603","Triathon des neiges","Distance S","Ski de Fond",6000,6600.0000000000009,5400,4.5,"Min/km",4.4999999999999997E-3,26.999999999999996,33.749999999999993,37.79999999999999,{"$f":"O199","v":16.874999999999996},6000,7499.9999999999991,8399.9999999999982,{"$f":"S199+1","v":3750.9999999999995},{"$f":"VLOOKUP(F203,AGE!F:J,4,FALSE)","v":2003},{"$f":"VLOOKUP(F203,AGE!F:J,5,FALSE)","v":1920}]
[70,60,4,{"$f":"CONCATENATE(A204,B204,C204)","v":"70604"},"Triathon des neiges","Distance S","Total",{"$f":"+SUM(H201:H203)","v":17000},{"$f":"SUM(I201:I202)","v":12100},{"$f":"SUM(J201:J202)","v":9900},null,null,"",{"$f":"SUM(N201:N202)","v":46},{"$f":"SUM(O201:O202)","v":57.5},null,{"$f":"SUM(Q201:Q202)","v":28.75},{"$f":"SUM(R201:R203)","v":17000},{"$f":"SUM(S201:S203)","v":21250},null,{"$f":"SUM(U201:U203)","v":10628},{"$f":"VLOOKUP(F204,AGE!F:J,4,FALSE)","v":2003},{"$f":"VLOOKUP(F204,AGE!F:J,5,FALSE)","v":1920}]
[70,70,1,"70701","Triathon des neiges","Distance M","Course à pied",8000,{"$f":"H205*1.1","v":8800},{"$f":"H205*0.9","v":7200},4.5,"Min/km",{"$f":"IF(L205=\"Sec/100m\",((K205)/60/100),(IF(L205=\"Km/h\",60/K205/1000,(IF(L205=\"Min/km\",K205/1000,\"\")))))","v":4.4999999999999997E-3},{"$f":"H205*M205","v":36},{"$f":"N205*1.25","v":45},{"$f":"N205*1.4","v":50.4},{"$f":"O201","v":22.5},{"$f":"N205/M205","v":8000.0000000000009},{"$f":"O205/M205","v":10000},{"$f":"P205/M205","v":11200},{"$f":"S201+1","v":5001},{"$f":"VLOOKUP(F205,AGE!F:J,4,FALSE)","v":2001},{"$f":"VLOOKUP(F205,AGE!F:J,5,FALSE)","v":1920}]
[70,70,2,"70702","Triathon des neiges","Distance M","Cyclisme",14000,15400.000000000002,12600,15,"Km/h",4.0000000000000001E-3,56,70,78.399999999999991,{"$f":"O202","v":35},14000,17500,19599.999999999996,{"$f":"S202+1","v":8751},{"$f":"VLOOKUP(F206,AGE!F:J,4,FALSE)","v":2001},{"$f":"VLOOKUP(F206,AGE!F:J,5,FALSE)","v":1920}]
[70,70,3,"70703","Triathon des neiges","Distance M","Ski de Fond",12000,13200.000000000002,10800,4.5,"Min/km",4.4999999999999997E-3,53.999999999999993,67.499999999999986,75.59999999999998,{"$f":"O203","v":33.749999999999993},12000,14999.999999999998,16799.999999999996,{"$f":"S203+1","v":7500.9999999999991},{"$f":"VLOOKUP(F207,AGE!F:J,4,FALSE)","v":2001},{"$f":"VLOOKUP(F207,AGE!F:J,5,FALSE)","v":1920}]
[70,70,4,{"$f":"CONCATENATE(A208,B208,C208)","v":"70704"},"Triathon des neiges","Distance M","Total",{"$f":"+SUM(H205:H207)","v":34000},{"$f":"SUM(I205:I206)","v":24200},{"$f":"SUM(J205:J206)","v":19800},null,null,"",{"$f":"SUM(N205:N206)","v":92},{"$f":"SUM(O205:O206)","v":115},null,{"$f":"SUM(Q205:Q206)","v":57.5},{"$f":"SUM(R205:R207)","v":34000},{"$f":"SUM(S205:S207)","v":42500},null,{"$f":"SUM(U205:U207)","v":21253},{"$f":"VLOOKUP(F208,AGE!F:J,4,FALSE)","v":2001},{"$f":"VLOOKUP(F208,AGE!F:J,5,FALSE)","v":1920}]
[80,50,1,"80501","Duathlon des neiges","Distance XS","Course à pied",2000,{"$f":"H209*1.1","v":2200},{"$f":"H209*0.9","v":1800},4.5,"Min/km",{"$f":"IF(L209=\"Sec/100m\",((K209)/60/100),(IF(L209=\"Km/h\",60/K209/1000,(IF(L209=\"Min/km\",K209/1000,\"\")))))","v":4.4999999999999997E-3},{"$f":"H209*M209","v":9},{"$f":"N209*1.25","v":11.25},{"$f":"N209*1.4","v":12.6},{"$f":"O205","v":45},{"$f":"N209/M209","v":2000.0000000000002},{"$f":"O209/M209","v":2500},{"$f":"P209/M209","v":2800},{"$f":"S205+1","v":10001},{"$f":"VLOOKUP(F209,AGE!F:J,4,FALSE)","v":2007},{"$f":"VLOOKUP(F209,AGE!F:J,5,FALSE)","v":1920}]
[80,50,2,{"$f":"CONCATENATE(A210,B210,C210)","v":"80502"},"Duathlon des neiges","Distance XS","Ski de Fond",3000,3300.0000000000005,2700,4.5,"Min/km",4.4999999999999997E-3,13.499999999999998,16.874999999999996,18.899999999999995,{"$f":"O206","v":70},3000,3749.9999999999995,4199.9999999999991,{"$f":"S206+1","v":17501},{"$f":"VLOOKUP(F210,AGE!F:J,4,FALSE)","v":2007},{"$f":"VLOOKUP(F210,AGE!F:J,5,FALSE)","v":1920}]
[80,50,3,"80503","Duathlon des neiges","Distance XS","Course à pied",2000,{"$f":"H211*1.1","v":2200},{"$f":"H211*0.9","v":1800},4.5,"Min/km",{"$f":"IF(L211=\"Sec/100m\",((K211)/60/100),(IF(L211=\"Km/h\",60/K211/1000,(IF(L211=\"Min/km\",K211/1000,\"\")))))","v":4.4999999999999997E-3},{"$f":"H211*M211","v":9},{"$f":"N211*1.25","v":11.25},12.6,{"$f":"O207","v":67.499999999999986},{"$f":"N211/M211","v":2000.0000000000002},{"$f":"O211/M211","v":2500},{"$f":"P211/M211","v":2800},{"$f":"S207+1","v":15000.999999999998},{"$f":"VLOOKUP(F211,AGE!F:J,4,FALSE)","v":2007},{"$f":"VLOOKUP(F211,AGE!F:J,5,FALSE)","v":1920}]
[80,50,4,{"$f":"CONCATENATE(A212,B212,C212)","v":"80504"},"Duathlon des neiges","Distance XS","Total",{"$f":"+SUM(H209:H211)","v":7000},{"$f":"SUM(I209:I210)","v":5500},{"$f":"SUM(J209:J210)","v":4500},null,null,"",{"$f":"SUM(N209:N210)","v":22.5},{"$f":"SUM(O209:O210)","v":28.124999999999996},null,{"$f":"SUM(Q209:Q210)","v":115},{"$f":"SUM(R209:R211)","v":7000},{"$f":"SUM(S209:S211)","v":8750},null,{"$f":"SUM(U209:U211)","v":42503},{"$f":"VLOOKUP(F212,AGE!F:J,4,FALSE)","v":2007},{"$f":"VLOOKUP(F212,AGE!F:J,5,FALSE)","v":1920}]
[80,60,1,"80601","Duathlon des neiges","Distance S","Course à pied",4000,{"$f":"H213*1.1","v":4400},{"$f":"H213*0.9","v":3600},4.5,"Min/km",{"$f":"IF(L213=\"Sec/100m\",((K213)/60/100),(IF(L213=\"Km/h\",60/K213/1000,(IF(L213=\"Min/km\",K213/1000,\"\")))))","v":4.4999999999999997E-3},{"$f":"H213*M213","v":18},{"$f":"N213*1.25","v":22.5},{"$f":"N213*1.4","v":25.2},{"$f":"O209","v":11.25},{"$f":"N213/M213","v":4000.0000000000005},{"$f":"O213/M213","v":5000},{"$f":"P213/M213","v":5600},{"$f":"S209+1","v":2501},{"$f":"VLOOKUP(F213,AGE!F:J,4,FALSE)","v":2003},{"$f":"VLOOKUP(F213,AGE!F:J,5,FALSE)","v":1920}]
[80,60,2,"80602","Duathlon des neiges","Distance S","Ski de Fond",6000,6600.0000000000009,{"$f":"H214*0.9","v":5400},4.5,"Min/km",{"$f":"IF(L214=\"Sec/100m\",((K214)/60/100),(IF(L214=\"Km/h\",60/K214/1000,(IF(L214=\"Min/km\",K214/1000,\"\")))))","v":4.4999999999999997E-3},{"$f":"H214*M214","v":26.999999999999996},33.749999999999993,37.79999999999999,{"$f":"O210","v":16.874999999999996},{"$f":"N214/M214","v":6000},{"$f":"O214/M214","v":7499.9999999999991},{"$f":"P214/M214","v":8399.9999999999982},{"$f":"S210+1","v":3750.9999999999995},{"$f":"VLOOKUP(F214,AGE!F:J,4,FALSE)","v":2003},{"$f":"VLOOKUP(F214,AGE!F:J,5,FALSE)","v":1920}]
[80,60,3,"80603","Duathlon des neiges","Distance S","Course à pied",4000,{"$f":"H215*1.1","v":4400},{"$f":"H215*0.9","v":3600},4.5,"Min/km",{"$f":"IF(L215=\"Sec/100m\",((K215)/60/100),(IF(L215=\"Km/h\",60/K215/1000,(IF(L215=\"Min/km\",K215/1000,\"\")))))","v":4.4999999999999997E-3},{"$f":"H215*M215","v":18},{"$f":"N215*1.25","v":22.5},25.2,{"$f":"O211","v":11.25},{"$f":"N215/M215","v":4000.0000000000005},{"$f":"O215/M215","v":5000},{"$f":"P215/M215","v":5600},{"$f":"S211+1","v":2501},{"$f":"VLOOKUP(F215,AGE!F:J,4,FALSE)","v":2003},{"$f":"VLOOKUP(F215,AGE!F:J,5,FALSE)","v":1920}]
[80,60,4,"80604","Duathlon des neiges","Distance S","Total",{"$f":"+SUM(H213:H215)","v":14000},{"$f":"SUM(I213:I214)","v":11000},{"$f":"SUM(J213:J214)","v":9000},null,null,"",{"$f":"SUM(N213:N214)","v":45},{"$f":"SUM(O213:O214)","v":56.249999999999993},null,{"$f":"SUM(Q213:Q214)","v":28.124999999999996},{"$f":"SUM(R213:R215)","v":14000},{"$f":"SUM(S213:S215)","v":17500},null,{"$f":"SUM(U213:U215)","v":8753},{"$f":"VLOOKUP(F216,AGE!F:J,4,FALSE)","v":2003},{"$f":"VLOOKUP(F216,AGE!F:J,5,FALSE)","v":1920}]
[80,70,1,"80701","Duathlon des neiges","Distance M","Course à pied",8000,{"$f":"H217*1.1","v":8800},{"$f":"H217*0.9","v":7200},4.5,"Min/km",{"$f":"IF(L217=\"Sec/100m\",((K217)/60/100),(IF(L217=\"Km/h\",60/K217/1000,(IF(L217=\"Min/km\",K217/1000,\"\")))))","v":4.4999999999999997E-3},{"$f":"H217*M217","v":36},{"$f":"N217*1.25","v":45},{"$f":"N217*1.4","v":50.4},{"$f":"O213","v":22.5},{"$f":"N217/M217","v":8000.0000000000009},{"$f":"O217/M217","v":10000},{"$f":"P217/M217","v":11200},{"$f":"S213+1","v":5001},{"$f":"VLOOKUP(F217,AGE!F:J,4,FALSE)","v":2001},{"$f":"VLOOKUP(F217,AGE!F:J,5,FALSE)","v":1920}]
[80,70,2,"80702","Duathlon des neiges","Distance M","Ski de Fond",12000,13200.000000000002,10800,4.5,"Min/km",4.4999999999999997E-3,53.999999999999993,67.499999999999986,75.59999999999998,{"$f":"O214","v":33.749999999999993},12000,14999.999999999998,16799.999999999996,{"$f":"S214+1","v":7500.9999999999991},{"$f":"VLOOKUP(F218,AGE!F:J,4,FALSE)","v":2001},{"$f":"VLOOKUP(F218,AGE!F:J,5,FALSE)","v":1920}]
[80,70,3,"80703","Duathlon des neiges","Distance M","Course à pied",8000,{"$f":"H219*1.1","v":8800},{"$f":"H219*0.9","v":7200},4.5,"Min/km",{"$f":"IF(L219=\"Sec/100m\",((K219)/60/100),(IF(L219=\"Km/h\",60/K219/1000,(IF(L219=\"Min/km\",K219/1000,\"\")))))","v":4.4999999999999997E-3},{"$f":"H219*M219","v":36},{"$f":"N219*1.25","v":45},50.4,{"$f":"O215","v":22.5},{"$f":"N219/M219","v":8000.0000000000009},{"$f":"O219/M219","v":10000},{"$f":"P219/M219","v":11200},{"$f":"S215+1","v":5001},{"$f":"VLOOKUP(F219,AGE!F:J,4,FALSE)","v":2001},{"$f":"VLOOKUP(F219,AGE!F:J,5,FALSE)","v":1920}]
[80,70,4,"80704","Duathlon des neiges","Distance M","Total",{"$f":"+SUM(H217:H219)","v":28000},{"$f":"SUM(I217:I218)","v":22000},{"$f":"SUM(J217:J218)","v":18000},null,null,"",{"$f":"SUM(N217:N218)","v":90},{"$f":"SUM(O217:O218)","v":112.49999999999999},null,{"$f":"SUM(Q217:Q218)","v":56.249999999999993},{"$f":"SUM(R217:R219)","v":28000},{"$f":"SUM(S217:S219)","v":35000},null,{"$f":"SUM(U217:U219)","v":17503},{"$f":"VLOOKUP(F220,AGE!F:J,4,FALSE)","v":2001},{"$f":"VLOOKUP(F220,AGE!F:J,5,FALSE)","v":1920}]
[90,10,1,"90101","Raid","Jeune 6-9","Raid",null,null,null,null,null,null,{"$f":"(O221+Q221)/2","v":90},120,null,{"$f":"+O221/2","v":60},null,null,null,null,{"$f":"VLOOKUP(F221,AGE!F:J,4,FALSE)","v":2013},{"$f":"VLOOKUP(F221,AGE!F:J,5,FALSE)","v":2010}]
[90,20,1,"90201","Raid","Jeune 8-11","Raid",null,null,null,null,null,null,{"$f":"(O222+Q222)/2","v":150},180,null,120,null,null,null,null,{"$f":"VLOOKUP(F222,AGE!F:J,4,FALSE)","v":2011},{"$f":"VLOOKUP(F222,AGE!F:J,5,FALSE)","v":2008}]
[90,30,1,"90301","Raid","Jeune 10-13","Raid",null,null,null,null,null,null,210,{"$f":"+O222+60","v":240},null,{"$f":"+O222","v":180},null,null,null,null,{"$f":"VLOOKUP(F223,AGE!F:J,4,FALSE)","v":2009},{"$f":"VLOOKUP(F223,AGE!F:J,5,FALSE)","v":2006}]
[90,40,1,"90401","Raid","Jeune 12-19","Raid",null,null,null,null,null,null,270,{"$f":"+O223+60","v":300},null,{"$f":"+O223","v":240},null,null,null,null,{"$f":"VLOOKUP(F224,AGE!F:J,4,FALSE)","v":2007},{"$f":"VLOOKUP(F224,AGE!F:J,5,FALSE)","v":2000}]
[90,50,1,"90501","Raid","Distance XS","Raid",null,null,null,null,null,null,330,360,null,{"$f":"5*60","v":300},null,null,null,null,{"$f":"VLOOKUP(F225,AGE!F:J,4,FALSE)","v":2007},{"$f":"VLOOKUP(F225,AGE!F:J,5,FALSE)","v":1920}]
[90,60,1,"90601","Raid","Distance S","Raid",null,null,null,null,null,null,360,{"$f":"Q227","v":420},null,{"$f":"5*60","v":300},null,null,null,null,{"$f":"VLOOKUP(F226,AGE!F:J,4,FALSE)","v":2003},{"$f":"VLOOKUP(F226,AGE!F:J,5,FALSE)","v":1920}]
[90,70,1,"90701","Raid","Distance M","Raid",null,null,null,null,null,null,570,{"$f":"Q228","v":720},null,{"$f":"7*60","v":420},null,null,null,null,{"$f":"VLOOKUP(F227,AGE!F:J,4,FALSE)","v":2001},{"$f":"VLOOKUP(F227,AGE!F:J,5,FALSE)","v":1920}]
[90,80,1,"90801","Raid","Distance L","Raid",null,null,null,null,null,null,1080,1440,null,{"$f":"12*60","v":720},null,null,null,null,{"$f":"VLOOKUP(F228,AGE!F:J,4,FALSE)","v":2001},{"$f":"VLOOKUP(F228,AGE!F:J,5,FALSE)","v":1920}]
[90,90,1,"90901","Raid","Distance XL","Raid",null,null,null,null,null,null,1800,2160,null,{"$f":"24*60","v":1440},null,null,null,null,{"$f":"VLOOKUP(F229,AGE!F:J,4,FALSE)","v":2001},{"$f":"VLOOKUP(F229,AGE!F:J,5,FALSE)","v":1920}]
[90,91,1,"90911","Raid","Distance XXL","Raid",null,null,null,null,null,null,2330,2500,null,{"$f":"36*60","v":2160},null,null,null,null,{"$f":"VLOOKUP(F230,AGE!F:J,4,FALSE)","v":2001},{"$f":"VLOOKUP(F230,AGE!F:J,5,FALSE)","v":1920}]
[91,50,1,"91501","Swim Run","Distance XS","Swim Run",{"$f":"(I231+J231)/2","v":3500},5000,2000,105,"Sec/100m",{"$f":"IF(L231=\"Sec/100m\",((K231)/60/100),(IF(L231=\"Km/h\",60/K231/1000,(IF(L231=\"Min/km\",K231/1000,\"\")))))","v":1.7500000000000002E-2},{"$f":"H231*M231","v":61.250000000000007},{"$f":"N231*1.25","v":76.562500000000014},null,{"$f":"O231/2","v":38.281250000000007},{"$f":"N231/M231","v":3500},null,null,null,{"$f":"VLOOKUP(F231,AGE!F:J,4,FALSE)","v":2007},{"$f":"VLOOKUP(F231,AGE!F:J,5,FALSE)","v":1920}]
[91,50,4,{"$f":"CONCATENATE(A232,B232,C232)","v":"91504"},"Swim Run","Distance XS","Swim Run",{"$f":"(I232+J232)/2","v":3500},5000,2000,105,"Sec/100m",{"$f":"IF(L232=\"Sec/100m\",((K232)/60/100),(IF(L232=\"Km/h\",60/K232/1000,(IF(L232=\"Min/km\",K232/1000,\"\")))))","v":1.7500000000000002E-2},{"$f":"H232*M232","v":61.250000000000007},{"$f":"N232*1.25","v":76.562500000000014},null,{"$f":"O232/2","v":38.281250000000007},{"$f":"N232/M232","v":3500},null,null,null,{"$f":"VLOOKUP(F232,AGE!F:J,4,FALSE)","v":2007},{"$f":"VLOOKUP(F232,AGE!F:J,5,FALSE)","v":1920}]
[91,60,1,"91601","Swim Run","Distance S","Swim Run",{"$f":"(I233+J233)/2","v":8750},12500,5000,105,"Sec/100m",1.7500000000000002E-2,153.12500000000003,191.40625000000003,null,{"$f":"O231+1","v":77.562500000000014},8750,null,null,null,{"$f":"VLOOKUP(F233,AGE!F:J,4,FALSE)","v":2003},{"$f":"VLOOKUP(F233,AGE!F:J,5,FALSE)","v":1920}]
[91,60,4,{"$f":"CONCATENATE(A234,B234,C234)","v":"91604"},"Swim Run","Distance S","Swim Run",{"$f":"(I234+J234)/2","v":8750},12500,5000,105,"Sec/100m",{"$f":"IF(L234=\"Sec/100m\",((K234)/60/100),(IF(L234=\"Km/h\",60/K234/1000,(IF(L234=\"Min/km\",K234/1000,\"\")))))","v":1.7500000000000002E-2},{"$f":"H234*M234","v":153.12500000000003},{"$f":"N234*1.25","v":191.40625000000003},null,{"$f":"O232+1","v":77.562500000000014},{"$f":"N234/M234","v":8750},null,null,null,{"$f":"VLOOKUP(F234,AGE!F:J,4,FALSE)","v":2003},{"$f":"VLOOKUP(F234,AGE!F:J,5,FALSE)","v":1920}]
[91,70,1,"91701","Swim Run","Distance M","Swim Run",16250,20000,12500,105,"Sec/100m",1.7500000000000002E-2,284.375,355.46875,null,192.40625000000003,16249.999999999998,null,null,null,{"$f":"VLOOKUP(F235,AGE!F:J,4,FALSE)","v":2001},{"$f":"VLOOKUP(F235,AGE!F:J,5,FALSE)","v":1920}]
[91,70,4,{"$f":"CONCATENATE(A236,B236,C236)","v":"91704"},"Swim Run","Distance M","Swim Run",{"$f":"(I236+J236)/2","v":16250},20000,12500,105,"Sec/100m",{"$f":"IF(L236=\"Sec/100m\",((K236)/60/100),(IF(L236=\"Km/h\",60/K236/1000,(IF(L236=\"Min/km\",K236/1000,\"\")))))","v":1.7500000000000002E-2},{"$f":"H236*M236","v":284.375},{"$f":"N236*1.25","v":355.46875},null,192.40625000000003,{"$f":"N236/M236","v":16249.999999999998},null,null,null,{"$f":"VLOOKUP(F236,AGE!F:J,4,FALSE)","v":2001},{"$f":"VLOOKUP(F236,AGE!F:J,5,FALSE)","v":1920}]
[91,80,1,"91801","Swim Run","Distance L","Swim Run",27500,35000,20000,105,"Sec/100m",1.7500000000000002E-2,481.25000000000006,601.56250000000011,null,356.46875,27500,null,null,null,{"$f":"VLOOKUP(F237,AGE!F:J,4,FALSE)","v":2001},{"$f":"VLOOKUP(F237,AGE!F:J,5,FALSE)","v":1920}]
[91,80,4,{"$f":"CONCATENATE(A238,B238,C238)","v":"91804"},"Swim Run","Distance L","Swim Run",{"$f":"(I238+J238)/2","v":27500},35000,20000,105,"Sec/100m",{"$f":"IF(L238=\"Sec/100m\",((K238)/60/100),(IF(L238=\"Km/h\",60/K238/1000,(IF(L238=\"Min/km\",K238/1000,\"\")))))","v":1.7500000000000002E-2},{"$f":"H238*M238","v":481.25000000000006},{"$f":"N238*1.25","v":601.56250000000011},null,356.46875,{"$f":"N238/M238","v":27500},null,null,null,{"$f":"VLOOKUP(F238,AGE!F:J,4,FALSE)","v":2001},{"$f":"VLOOKUP(F238,AGE!F:J,5,FALSE)","v":1920}]
[91,90,1,"91901","Swim Run","Distance XL","Swim Run",45000,55000,35000,105,"Sec/100m",1.7500000000000002E-2,787.50000000000011,984.37500000000011,null,602.56250000000011,45000,null,null,null,{"$f":"VLOOKUP(F239,AGE!F:J,4,FALSE)","v":2001},{"$f":"VLOOKUP(F239,AGE!F:J,5,FALSE)","v":1920}]
[91,90,4,{"$f":"CONCATENATE(A240,B240,C240)","v":"91904"},"Swim Run","Distance XL","Swim Run",{"$f":"(I240+J240)/2","v":45000},55000,35000,105,"Sec/100m",{"$f":"IF(L240=\"Sec/100m\",((K240)/60/100),(IF(L240=\"Km/h\",60/K240/1000,(IF(L240=\"Min/km\",K240/1000,\"\")))))","v":1.7500000000000002E-2},{"$f":"H240*M240","v":787.50000000000011},{"$f":"N240*1.25","v":984.37500000000011},null,602.56250000000011,{"$f":"N240/M240","v":45000},null,null,null,{"$f":"VLOOKUP(F240,AGE!F:J,4,FALSE)","v":2001},{"$f":"VLOOKUP(F240,AGE!F:J,5,FALSE)","v":1920}]
[91,91,1,"91911","Swim Run","Distance XXL","Swim Run",68750,55000,{"$f":"+I241*1.5","v":82500},105,"Sec/100m",1.7500000000000002E-2,1203.1250000000002,1503.9062500000002,null,985.37500000000011,68750,null,null,null,{"$f":"VLOOKUP(F241,AGE!F:J,4,FALSE)","v":2001},{"$f":"VLOOKUP(F241,AGE!F:J,5,FALSE)","v":1920}]
[91,91,4,{"$f":"CONCATENATE(A242,B242,C242)","v":"91914"},"Swim Run","Distance XXL","Swim Run",{"$f":"(I242+J242)/2","v":68750},55000,{"$f":"+I242*1.5","v":82500},105,"Sec/100m",{"$f":"IF(L242=\"Sec/100m\",((K242)/60/100),(IF(L242=\"Km/h\",60/K242/1000,(IF(L242=\"Min/km\",K242/1000,\"\")))))","v":1.7500000000000002E-2},{"$f":"H242*M242","v":1203.1250000000002},{"$f":"N242*1.25","v":1503.9062500000002},null,985.37500000000011,{"$f":"N242/M242","v":68750},null,null,null,{"$f":"VLOOKUP(F242,AGE!F:J,4,FALSE)","v":2001},{"$f":"VLOOKUP(F242,AGE!F:J,5,FALSE)","v":1920}]

{"sheet":"AGE","index":1,"n_rows":11,"n_cols":10,"rows_kept":11,"cut":false,"hidden":true,"merged":[]}
[null,"MOIS A PARTIR DUQUEL ON AFFICHE LES CATEGORIES D'AGE DE LA SAISON SUIVANTE :",null,"ANNEE AFFICHEE",null,"Course","Age atteint au cours de la saison mini","Age atteint au cours de la saison maxi","ANNEE mini","ANNEE maxi"]
[null,9,null,{"$f":"IF(MONTH(TODAY())>=B2,YEAR(TODAY())+1,YEAR(TODAY()))","v":2019},null,"Jeune 6-9",6,9,{"$f":"$D$2-G2","v":2013},{"$f":"$D$2-H2","v":2010}]
[null,null,null,null,null,"Jeune 8-11",8,11,{"$f":"$D$2-G3","v":2011},2008]
[null,null,null,null,null,"Jeune 10-13",10,13,2009,2006]
[null,null,null,null,null,"Jeune 12-19",12,19,2007,2000]
[null,null,null,null,null,"Distance XS",12,99,2007,1920]
[null,null,null,null,null,"Distance S",16,99,2003,1920]
[null,null,null,null,null,"Distance M",18,99,2001,1920]
[null,null,null,null,null,"Distance L",18,99,2001,1920]
[null,null,null,null,null,"Distance XL",18,99,2001,1920]
[null,null,null,null,null,"Distance XXL",18,99,2001,1920]

{"sheet":"Visualisation","index":2,"n_rows":23,"n_cols":20,"rows_kept":23,"cut":false,"hidden":false,"merged":[[0,2,0,3],[3,13,3,15],[3,10,3,12],[18,9,18,11],[3,2,3,9],[18,2,18,3],[10,11,10,12],[10,13,10,14],[11,11,11,12],[12,11,12,12],[13,11,13,12],[14,11,14,12],[11,13,11,14],[12,13,12,14],[13,13,13,14],[14,13,14,14]]}
["V 1,006",null,"Saisie case en Jaune",null,null,null,null,null,null,4,5,6,7,11,12,13,14,16,17,18]
[]
[]
[null,null,"Triathlon, Duathlon, Aquathlon, Swimrun \nDistances possibles ",null,null,null,null,null,null,null,"Epreuve Officielle",null,null,{"$f":"IF(OR(C12=\"Raid\",C12=\"Bike_and_Run\",C12=\"Swim_Run\"),\"\",\"Epreuve Assimilée\")","v":"Epreuve Assimilée"}]
[null,null,"Sélectionner la Compétition","Sélectionner le type d'épreuve",null,null,null,null,null,"Discipline","Distance Officielle","Tolérance Max +10%","Tolérance Min  -10%","Limite Haute 25%\n(distance)","Limite Haute 40% jeunes\n(Distance)","Limite Basse\n(distance)"]
[null,null,null,null,{"$f":"VLOOKUP(C6,'Liste déroulante'!$B$5:$C$14,2)","v":{"$error":"#N/A"}},{"$f":"VLOOKUP(D6,'Liste déroulante'!E5:F14,2)","v":{"$error":"#N/A"}},1,{"$f":"CONCATENATE(E6,F6,G6)","v":{"$error":"#N/A"}},{"$f":"IF(COUNTIF(Données!D:D,Visualisation!H6)>0, \"vrai\",\"faux\")","v":"faux"},{"$f":"IF($I6=\"FAUX\",\"\",VLOOKUP($H6,Données!$D$5:$U$241,$J$1))","v":""},{"$f":"IF($I6=\"FAUX\",\"\",VLOOKUP($H6,Données!$D$5:$U$241,K1))","v":""},{"$f":"IF($I6=\"FAUX\",\"\",VLOOKUP($H6,Données!$D$5:$U$241,L1))","v":""},{"$f":"IF($I6=\"FAUX\",\"\",VLOOKUP($H6,Données!$D$5:$U$241,M1))","v":""},{"$f":"IF($I6=\"FAUX\",\"\",VLOOKUP($H6,Données!$D$5:$U$241,R1))","v":""},{"$f":"IF($I6=\"FAUX\",\"\",VLOOKUP($H6,Données!$D$5:$U$241,S1))","v":""},{"$f":"IF($I6=\"FAUX\",\"\",VLOOKUP($H6,Données!$D$5:$U$241,T1))","v":""}]
[null,null,null,null,null,null,2,{"$f":"CONCATENATE(E6,F6,G7)","v":{"$error":"#N/A"}},{"$f":"IF(COUNTIF(Données!D:D,Visualisation!H7)>0, \"vrai\",\"faux\")","v":"faux"},{"$f":"IF($I7=\"FAUX\",\"\",VLOOKUP($H7,Données!$D$5:$U$241,J1))","v":""},{"$f":"IF($I7=\"FAUX\",\"\",VLOOKUP($H7,Données!$D$5:$U$241,K1))","v":""},{"$f":"IF($I7=\"FAUX\",\"\",VLOOKUP($H7,Données!$D$5:$U$241,L1))","v":""},{"$f":"IF($I7=\"FAUX\",\"\",VLOOKUP($H7,Données!$D$5:$U$241,M1))","v":""},{"$f":"IF($I7=\"FAUX\",\"\",VLOOKUP($H7,Données!$D$5:$U$241,R1))","v":""},{"$f":"IF($I7=\"FAUX\",\"\",VLOOKUP($H7,Données!$D$5:$U$241,S1))","v":""},{"$f":"IF($I7=\"FAUX\",\"\",VLOOKUP($H7,Données!$D$5:$U$241,T1))","v":""}]
[null,null,null,null,null,null,{"$f":"IF(C6=\"Aquathlon\",\"\",3)","v":3},{"$f":"CONCATENATE(E6,F6,G8)","v":{"$error":"#N/A"}},{"$f":"IF(COUNTIF(Données!D:D,Visualisation!H8)>0, \"vrai\",\"faux\")","v":"faux"},{"$f":"IF($I8=\"FAUX\",\"\",VLOOKUP($H8,Données!$D$5:$U$241,J1))","v":""},{"$f":"IF($I8=\"FAUX\",\"\",VLOOKUP($H8,Données!$D$5:$U$241,K1))","v":""},{"$f":"IF($I8=\"FAUX\",\"\",VLOOKUP($H8,Données!$D$5:$U$241,L1))","v":""},{"$f":"IF($I8=\"FAUX\",\"\",VLOOKUP($H8,Données!$D$5:$U$241,M1))","v":""},{"$f":"IF($I8=\"FAUX\",\"\",VLOOKUP($H8,Données!$D$5:$U$241,R1))","v":""},{"$f":"IF($I8=\"FAUX\",\"\",VLOOKUP($H8,Données!$D$5:$U$241,S1))","v":""},{"$f":"IF($I8=\"FAUX\",\"\",VLOOKUP($H8,Données!$D$5:$U$241,T1))","v":""}]
[null,null,null,null,null,null,4,{"$f":"CONCATENATE(E6,F6,G9)","v":{"$error":"#N/A"}},{"$f":"IF(COUNTIF(Données!D:D,Visualisation!H9)>0, \"vrai\",\"faux\")","v":"faux"},{"$f":"IF($I9=\"FAUX\",\"\",VLOOKUP($H9,Données!$D$5:$U$241,J1))","v":""},{"$f":"IF($I9=\"FAUX\",\"\",VLOOKUP($H9,Données!$D$5:$U$241,K1))","v":""},{"$f":"IF($I9=\"FAUX\",\"\",VLOOKUP($H9,Données!$D$5:$U$241,L1))","v":""},{"$f":"IF($I9=\"FAUX\",\"\",VLOOKUP($H9,Données!$D$5:$U$241,M1))","v":""},{"$f":"IF($I9=\"FAUX\",\"\",VLOOKUP($H9,Données!$D$5:$U$241,R1))","v":""},{"$f":"IF($I9=\"FAUX\",\"\",VLOOKUP($H9,Données!$D$5:$U$241,S1))","v":""},{"$f":"IF($I9=\"FAUX\",\"\",VLOOKUP($H9,Données!$D$5:$U$241,T1))","v":""}]
[]
[null,null,"Contrôlez vos distances",null,null,null,null,null,null,"Discipline","Saisir les distances\n en mètre","Epreuve Officielle",null,{"$f":"IF(OR(C12=\"Raid\",C12=\"Bike and Run\",C12=\"Swim Run\"),\"\",\"Epreuve Assimilée\")","v":"Epreuve Assimilée"},null,null,{"$f":"CONCATENATE(\"Année de naissance saison \",AGE!D2)","v":"Année de naissance saison 2019"}]
[null,null,{"$f":"+C6","v":0},{"$f":"+D6","v":0},null,null,null,null,null,{"$f":"+J6","v":""},null,{"$f":"IF($K12=0,\"\",IF(AND($K12>=M6,$K12<=L6),\"Approuvé\",\"Refusé\"))","v":""},null,{"$f":"IF(K12=0,\"\",IF(O6=0,\"\",(IF(OR(K12>O6,K12<P6),\"Refusé\",\"Approuvé\"))))","v":""},null,null,"Mini"]
[null,null,null,null,null,null,null,null,null,{"$f":"+J7","v":""},null,{"$f":"IF($K13=0,\"\",IF(L7=\"\",\"\",IF(AND($K13>=M7,$K13<=L7),\"Approuvé\",\"Refusé\")))","v":""},null,{"$f":"IF(K13=0,\"\",IF(O7=\"\",\"\",IF(O7=0,\"\",(IF(OR(K13>O7,K13<P7),\"Refusé\",\"Approuvé\")))))","v":""},null,null,{"$f":"IF($I9=\"FAUX\",\"\",VLOOKUP($H9,Données!$D$5:$W$241,19))","v":""}]
[null,null,null,null,null,null,null,null,null,{"$f":"+J8","v":""},null,{"$f":"IF($K14=0,\"\",IF(L8=\"\",\"\",IF(AND($K14>=M8,$K14<=L8),\"Approuvé\",\"Refusé\")))","v":""},null,{"$f":"IF(K14=0,\"\",IF(O8=\"\",\"\",IF(O8=0,\"\",(IF(OR(K14>O8,K14<P8),\"Refusé\",\"Approuvé\")))))","v":""},null,null,"Maxi"]
[null,null,null,null,null,null,null,null,null,null,{"$f":"IF(J14=\"\",SUM(K12:K13),SUM(K12:K14))","v":0},{"$f":"IF(L12=\"Refusé\",\"Refusé\",IF(L13=\"Refusé\",\"Refusé\",IF(L14=\"Refusé\",\"Refusé\",IF($K$15=0,\"\",IF(AND(K15>=M9,K15<=L9),\"Approuvé\",\"Refusé\")))))","v":""},null,{"$f":"IF(N12=\"Refusé\",\"Refusé\",IF(N13=\"Refusé\",\"Refusé\",IF(N14=\"Refusé\",\"Refusé\",IF($K$15=0,\"\",IF(AND(K15>=P9,K15<=N9),\"Approuvé\",IF(P9=\"\",\"\",\"Refusé\"))))))","v":""},null,null,{"$f":"IF($I9=\"FAUX\",\"\",VLOOKUP($H9,Données!$D$5:$W$241,20))","v":""}]
[]
[]
[]
[null,null,"Bike&Run & Raid \nTemps estimé ",null,null,null,null,null,null,"Epreuve Officielle",null,null,null,{"$f":"CONCATENATE(\"Année de naissance saison \",AGE!D2)","v":"Année de naissance saison 2019"}]
[null,null,"Sélectionner la Compétition","Sélectionner le type d'épreuve",null,null,null,null,null,"Temps Moyen","Temps Max","Temps Min",null,"Mini"]
[null,null,null,null,{"$f":"VLOOKUP(C21,'Liste déroulante'!$B$5:$C$14,2)","v":{"$error":"#N/A"}},{"$f":"VLOOKUP(D21,'Liste déroulante'!E5:F14,2)","v":{"$error":"#N/A"}},1,{"$f":"CONCATENATE(E21,F21,G21)","v":{"$error":"#N/A"}},{"$f":"IF(COUNTIF(Données!D:D,Visualisation!H21)>0, \"vrai\",\"faux\")","v":"faux"},{"$f":"IF($I21=\"FAUX\",\"\",VLOOKUP($H21,Données!$D$5:$U$241,N1))","v":""},{"$f":"IF($I21=\"FAUX\",\"\",VLOOKUP($H21,Données!$D$5:$U$241,O1))","v":""},{"$f":"IF($I21=\"FAUX\",\"\",VLOOKUP($H21,Données!$D$5:$U$241,Q1))","v":""},null,{"$f":"IF($I21=\"FAUX\",\"\",VLOOKUP($H21,Données!$D$5:$W$241,19))","v":""}]
[null,null,null,null,null,null,null,null,null,{"$f":"IF(J21=\"\",\"\",J21/60/24)","v":""},{"$f":"IF(J21=\"\",\"\",K21/60/24)","v":""},{"$f":"IF(J21=\"\",\"\",L21/60/24)","v":""},null,"Maxi"]
[null,null,null,null,null,null,null,null,null,null,null,null,null,{"$f":"IF($I21=\"FAUX\",\"\",VLOOKUP($H21,Données!$D$5:$W$241,20))","v":""}]

{"sheet":"Liste déroulante","index":3,"n_rows":26,"n_cols":26,"rows_kept":26,"cut":false,"hidden":true,"merged":[]}
[null,"Distance officielle",null,null,null,null,null,null,null,null,null,null,null,null,null,null,null,null,null,null,null,null,null,null,null,"MOIS"]
[null,null,null,null,null,null,null,null,null,null,null,null,null,null,null,null,null,null,null,null,null,10,"Jeune 6-9",null,null,1]
[null,null,null,null,null,null,null,null,null,null,null,null,null,null,null,null,null,null,null,null,null,20,"Jeune 8-11",null,null,2]
[null,"Type d'épreuve",null,null,"Catégorie d'âge",null,"Mini","Mini",null,null,null,null,null,null,null,null,null,null,null,null,null,30,"Jeunes 10-13",null,null,3]
[null,"Aquathlon",50,{"$f":"+VLOOKUP(B5,'Liste déroulante'!$B$5:$C$14,2)","v":50},"Distance L",80,{"$f":"+G23","v":2000},{"$f":"+H23","v":1919},{"$f":"+VLOOKUP(E5,$E$5:$F$14,2)","v":80},"Aquathlon","Jeune 6-9","Jeune 8-11","Jeune 10-13","Jeune 12-19","Distance XS","Distance S","Distance M","Distance L","Distance XL",null,null,40,"Jeune 12-19",null,null,4]
[null,"Bike_and_Run",60,{"$f":"+VLOOKUP(B6,'Liste déroulante'!$B$5:$C$14,2)","v":60},"Distance M",70,{"$f":"+G22","v":2000},{"$f":"+H22","v":1919},70,"Cross_Duathlon","Jeune 6-9","Jeune 8-11","Jeune 10-13","Jeune 12-19","Distance XS","Distance S","Distance M","Distance L","Distance XL",null,null,50,"Distance XS",null,null,5]
[null,"Cross_Duathlon",40,{"$f":"+VLOOKUP(B7,'Liste déroulante'!$B$5:$C$14,2)","v":40},"Distance S",60,{"$f":"+G21","v":2002},{"$f":"+H21","v":1919},60,"Cross_Triathlon","Jeune 6-9","Jeune 8-11","Jeune 10-13","Jeune 12-19","Distance XS","Distance S","Distance M","Distance L","Distance XL",null,null,60,"Distance S",null,null,6]
[null,"Cross_Triathlon",20,{"$f":"+VLOOKUP(B8,'Liste déroulante'!$B$5:$C$14,2)","v":20},"Distance XL",90,{"$f":"+G24","v":2000},{"$f":"+H24","v":1919},90,"Duathlon","Jeune 6-9","Jeune 8-11","Jeune 10-13","Jeune 12-19","Distance XS","Distance S","Distance M","Distance L","Distance XL",null,null,70,"Distance M",null,null,7]
[null,"Duathlon",30,{"$f":"+VLOOKUP(B9,'Liste déroulante'!$B$5:$C$14,2)","v":30},"Distance XS",50,{"$f":"+G20","v":2006},{"$f":"+H20","v":1919},50,"Duathlon_des_neiges","Distance XS","Distance S","Distance M",null,null,null,null,null,null,null,null,80,"Distance L",null,null,8]
[null,"Duathlon_des_neiges",80,{"$f":"+VLOOKUP(B10,'Liste déroulante'!$B$5:$C$14,2)","v":80},"Distance XXL",91,{"$f":"+G25","v":2000},{"$f":"+H25","v":1919},91,"Triathlon","Jeune 6-9","Jeune 8-11","Jeune 10-13","Jeune 12-19","Distance XS","Distance S","Distance M","Distance L","Distance XL","Distance XXL",null,90,"Distance XL",null,null,9]
[null,"Raid",90,{"$f":"+VLOOKUP(B11,'Liste déroulante'!$B$5:$C$14,2)","v":90},"Jeune 10 - 13",30,{"$f":"+G18","v":2008},{"$f":"+H18","v":2005},30,"Triathon_des_neiges","Distance XS","Distance S","Distance M",null,null,null,null,null,null,null,null,91,"Distance XXL",null,null,10]
[null,"Swim_Run",91,{"$f":"+VLOOKUP(B12,'Liste déroulante'!$B$5:$C$14,2)","v":91},"Jeune 12 - 19",40,{"$f":"+G26","v":2006},{"$f":"+H26","v":1999},{"$f":"+VLOOKUP(E12,$E$5:$F$14,2)","v":40},"Swim_Run","Distance XS","Distance S","Distance M","Distance L","Distance XL",null,null,null,null,null,null,91,"Distance XXL",null,null,11]
[null,"Triathlon",10,{"$f":"+VLOOKUP(B13,'Liste déroulante'!$B$5:$C$14,2)","v":10},"Jeune 6 - 9",10,{"$f":"+G19","v":2012},{"$f":"+H19","v":2009},{"$f":"+VLOOKUP(E13,$E$5:$F$14,2)","v":10},"Bike_and_Run","Jeune 6-9","Jeune 8-11","Jeune 10-13","Jeune 12-19","Distance XS","Distance S","Distance M","Distance L",null,null,null,null,null,null,null,12]
[null,"Triathon_des_neiges",70,{"$f":"+VLOOKUP(B14,'Liste déroulante'!$B$5:$C$14,2)","v":70},"Jeune 8 - 11",20,{"$f":"+G16","v":2010},{"$f":"+H16","v":2007},20,"Raid","Jeune 6-9","Jeune 8-11","Jeune 10-13","Jeune 12-19","Distance XS","Distance S","Distance M","Distance L","Distance XL","Distance XXL"]
[]
[null,null,null,null,{"$f":"+E14","v":"Jeune 8 - 11"},null,2010,2007]
[null,null,null,null,{"$f":"+E10","v":"Distance XXL"},null,2000,1919]
[null,null,null,null,{"$f":"+E11","v":"Jeune 10 - 13"},null,2008,2005]
[null,null,null,null,{"$f":"+E13","v":"Jeune 6 - 9"},null,2012,2009]
[null,null,null,null,"Distance XS",null,2006,1919]
[null,null,null,null,"Distance S",null,2002,1919]
[null,null,null,null,"Distance M",null,2000,1919]
[null,null,null,null,"Distance L",null,2000,1919]
[null,null,null,null,"Distance XL",null,2000,1919]
[null,null,null,null,"Distance XXL",null,2000,1919]
[null,null,null,null,"Jeune 12 - 19",null,2006,1999]